BDBM50383819 CHEMBL2030977
SMILES: Cc1ccc(cc1)-c1nn(cc1C(=O)Nc1ccc(Br)cc1)-c1ccccc1
InChI Key: InChIKey=SGYXNORAFHJWKX-UHFFFAOYSA-N
Data: 1 IC50
Activity Spreadsheet -- Enzyme Inhibition Constant Data from BindingDB
Found 1 hit for monomerid = 50383819
Trg + Lig
Ki
nM
ΔG°
kcal/mole
IC50
nM
Kd
nM
EC50/IC50
nM
koff
s-1
kon
M-1s-1
pHTemp
°C
Aurora kinase A
(Homo sapiens (Human))
BDBM50383819
(CHEMBL2030977)
Show SMILES Cc1ccc(cc1)-c1nn(cc1C(=O)Nc1ccc(Br)cc1)-c1ccccc1
Show InChI InChI=1S/C23H18BrN3O/c1-16-7-9-17(10-8-16)22-21(15-27(26-22)20-5-3-2-4-6-20)23(28)25-19-13-11-18(24)12-14-19/h2-15H,1H3,(H,25,28)
NCI pathway
Reactome pathway
n/an/a 7.32E+3n/an/an/an/an/an/a
Nanjing University
Curated by ChEMBL
Assay Description
Inhibition of human recombinant Aurora A kinase using biotinylated peptide substrate preincubated for 15 mins with compound measured after 30 mins by...
Bioorg Med Chem Lett 22: 3589-93 (2012)
Article DOI: 10.1016/j.bmcl.2012.04.066
BindingDB Entry DOI: 10.7270/Q2GF0VJZ