BDBM50383825 CHEMBL2030983
SMILES: CCOc1ccc(NC(=O)c2cn(nc2-c2ccc(OC)cc2)-c2ccccc2)cc1
InChI Key: InChIKey=VFXCDBNYCFNJFY-UHFFFAOYSA-N
Data: 1 IC50
Activity Spreadsheet -- Enzyme Inhibition Constant Data from BindingDB
Found 1 hit for monomerid = 50383825
Trg + Lig
Ki
nM
ΔG°
kcal/mole
IC50
nM
Kd
nM
EC50/IC50
nM
koff
s-1
kon
M-1s-1
pHTemp
°C
Aurora kinase A
(Homo sapiens (Human))
BDBM50383825
(CHEMBL2030983)
Show SMILES CCOc1ccc(NC(=O)c2cn(nc2-c2ccc(OC)cc2)-c2ccccc2)cc1
Show InChI InChI=1S/C25H23N3O3/c1-3-31-22-15-11-19(12-16-22)26-25(29)23-17-28(20-7-5-4-6-8-20)27-24(23)18-9-13-21(30-2)14-10-18/h4-17H,3H2,1-2H3,(H,26,29)
NCI pathway
Reactome pathway
n/an/a 780n/an/an/an/an/an/a
Nanjing University
Curated by ChEMBL
Assay Description
Inhibition of human recombinant Aurora A kinase using biotinylated peptide substrate preincubated for 15 mins with compound measured after 30 mins by...
Bioorg Med Chem Lett 22: 3589-93 (2012)
Article DOI: 10.1016/j.bmcl.2012.04.066
BindingDB Entry DOI: 10.7270/Q2GF0VJZ