BDBM50383826 CHEMBL2030984
SMILES: Clc1ccc(cc1)-c1nn(cc1C(=O)Nc1ccccc1)-c1ccccc1
InChI Key: InChIKey=IRCVINFJSKFBDN-UHFFFAOYSA-N
Data: 1 IC50
Activity Spreadsheet -- Enzyme Inhibition Constant Data from BindingDB
Found 1 hit for monomerid = 50383826
Trg + Lig
Ki
nM
ΔG°
kcal/mole
IC50
nM
Kd
nM
EC50/IC50
nM
koff
s-1
kon
M-1s-1
pHTemp
°C
Aurora kinase A
(Homo sapiens (Human))
BDBM50383826
(CHEMBL2030984)
Show SMILES Clc1ccc(cc1)-c1nn(cc1C(=O)Nc1ccccc1)-c1ccccc1
Show InChI InChI=1S/C22H16ClN3O/c23-17-13-11-16(12-14-17)21-20(22(27)24-18-7-3-1-4-8-18)15-26(25-21)19-9-5-2-6-10-19/h1-15H,(H,24,27)
NCI pathway
Reactome pathway
n/an/a 2.10E+3n/an/an/an/an/an/a
Nanjing University
Curated by ChEMBL
Assay Description
Inhibition of human recombinant Aurora A kinase using biotinylated peptide substrate preincubated for 15 mins with compound measured after 30 mins by...
Bioorg Med Chem Lett 22: 3589-93 (2012)
Article DOI: 10.1016/j.bmcl.2012.04.066
BindingDB Entry DOI: 10.7270/Q2GF0VJZ