BDBM50384004 CHEMBL2032276
SMILES: Cc1cc2oc(nc2cc1O)-c1cc(cnc1N)-c1cnn(c1)C1CCNCC1
InChI Key: InChIKey=BXVHRRLJGZKCBN-UHFFFAOYSA-N
Data: 2 IC50
Activity Spreadsheet -- Enzyme Inhibition Constant Data from BindingDB
Found 2 hits for monomerid = 50384004
Trg + Lig
Ki
nM
ΔG°
kcal/mole
IC50
nM
Kd
nM
EC50/IC50
nM
koff
s-1
kon
M-1s-1
pHTemp
°C
Receptor-type tyrosine-protein kinase FLT3
(Homo sapiens (Human))
BDBM50384004
(CHEMBL2032276)
Show SMILES Cc1cc2oc(nc2cc1O)-c1cc(cnc1N)-c1cnn(c1)C1CCNCC1
Show InChI InChI=1S/C21H22N6O2/c1-12-6-19-17(8-18(12)28)26-21(29-19)16-7-13(9-24-20(16)22)14-10-25-27(11-14)15-2-4-23-5-3-15/h6-11,15,23,28H,2-5H2,1H3,(H2,22,24)
n/an/a 2n/an/an/an/an/an/a
Korea Research Institute of Chemical Technology
Curated by ChEMBL
Assay Description
Inhibition of recombinant FLT3 by time resolved-fluorescence resonance energy transfer analysis
Bioorg Med Chem Lett 22: 4044-8 (2012)
Article DOI: 10.1016/j.bmcl.2012.04.083
BindingDB Entry DOI: 10.7270/Q2FF3TC4
Hepatocyte growth factor receptor
(Homo sapiens (Human))
BDBM50384004
(CHEMBL2032276)
Show SMILES Cc1cc2oc(nc2cc1O)-c1cc(cnc1N)-c1cnn(c1)C1CCNCC1
Show InChI InChI=1S/C21H22N6O2/c1-12-6-19-17(8-18(12)28)26-21(29-19)16-7-13(9-24-20(16)22)14-10-25-27(11-14)15-2-4-23-5-3-15/h6-11,15,23,28H,2-5H2,1H3,(H2,22,24)
n/an/a 27n/an/an/an/an/an/a
Korea Research Institute of Chemical Technology
Curated by ChEMBL
Assay Description
Inhibition of recombinant c-Met by time resolved-fluorescence resonance energy transfer analysis
Bioorg Med Chem Lett 22: 4044-8 (2012)
Article DOI: 10.1016/j.bmcl.2012.04.083
BindingDB Entry DOI: 10.7270/Q2FF3TC4