BDBM50384013 CHEMBL2032291
SMILES: Cn1cc(cn1)-c1cnc(N)c(c1)-c1nc2ccc(Cl)cc2o1
InChI Key: InChIKey=DVUWABCQLLNADO-UHFFFAOYSA-N
Data: 1 IC50
Activity Spreadsheet -- Enzyme Inhibition Constant Data from BindingDB
Found 1 hit for monomerid = 50384013
Trg + Lig
Ki
nM
ΔG°
kcal/mole
IC50
nM
Kd
nM
EC50/IC50
nM
koff
s-1
kon
M-1s-1
pHTemp
°C
Hepatocyte growth factor receptor
(Homo sapiens (Human))
BDBM50384013
(CHEMBL2032291)
Show SMILES Cn1cc(cn1)-c1cnc(N)c(c1)-c1nc2ccc(Cl)cc2o1
Show InChI InChI=1S/C16H12ClN5O/c1-22-8-10(7-20-22)9-4-12(15(18)19-6-9)16-21-13-3-2-11(17)5-14(13)23-16/h2-8H,1H3,(H2,18,19)
n/an/a 1.70E+3n/an/an/an/an/an/a
Korea Research Institute of Chemical Technology
Curated by ChEMBL
Assay Description
Inhibition of recombinant c-Met by time resolved-fluorescence resonance energy transfer analysis
Bioorg Med Chem Lett 22: 4044-8 (2012)
Article DOI: 10.1016/j.bmcl.2012.04.083
BindingDB Entry DOI: 10.7270/Q2FF3TC4