BDBM50384022 CHEMBL2032282
SMILES: Nc1ncc(cc1-c1nc2ccc(O)c(-c3cnccn3)c2o1)-c1cnn(c1)C1CCNCC1
InChI Key: InChIKey=RFMLRIANOITTIG-UHFFFAOYSA-N
Data: 2 IC50
Activity Spreadsheet -- Enzyme Inhibition Constant Data from BindingDB
Found 2 hits for monomerid = 50384022
Trg + Lig
Ki
nM
ΔG°
kcal/mole
IC50
nM
Kd
nM
EC50/IC50
nM
koff
s-1
kon
M-1s-1
pHTemp
°C
Receptor-type tyrosine-protein kinase FLT3
(Homo sapiens (Human))
BDBM50384022
(CHEMBL2032282)
Show SMILES Nc1ncc(cc1-c1nc2ccc(O)c(-c3cnccn3)c2o1)-c1cnn(c1)C1CCNCC1
Show InChI InChI=1S/C24H22N8O2/c25-23-17(9-14(10-29-23)15-11-30-32(13-15)16-3-5-26-6-4-16)24-31-18-1-2-20(33)21(22(18)34-24)19-12-27-7-8-28-19/h1-2,7-13,16,26,33H,3-6H2,(H2,25,29)
n/an/a 35n/an/an/an/an/an/a
Korea Research Institute of Chemical Technology
Curated by ChEMBL
Assay Description
Inhibition of recombinant FLT3 by time resolved-fluorescence resonance energy transfer analysis
Bioorg Med Chem Lett 22: 4044-8 (2012)
Article DOI: 10.1016/j.bmcl.2012.04.083
BindingDB Entry DOI: 10.7270/Q2FF3TC4
Hepatocyte growth factor receptor
(Homo sapiens (Human))
BDBM50384022
(CHEMBL2032282)
Show SMILES Nc1ncc(cc1-c1nc2ccc(O)c(-c3cnccn3)c2o1)-c1cnn(c1)C1CCNCC1
Show InChI InChI=1S/C24H22N8O2/c25-23-17(9-14(10-29-23)15-11-30-32(13-15)16-3-5-26-6-4-16)24-31-18-1-2-20(33)21(22(18)34-24)19-12-27-7-8-28-19/h1-2,7-13,16,26,33H,3-6H2,(H2,25,29)
n/an/a 8n/an/an/an/an/an/a
Korea Research Institute of Chemical Technology
Curated by ChEMBL
Assay Description
Inhibition of recombinant c-Met by time resolved-fluorescence resonance energy transfer analysis
Bioorg Med Chem Lett 22: 4044-8 (2012)
Article DOI: 10.1016/j.bmcl.2012.04.083
BindingDB Entry DOI: 10.7270/Q2FF3TC4