BDBM50384164 CHEMBL2029732
SMILES: CN(CCCC(=O)NCCF)C(=O)c1ccc2n(C)c3CC[C@H](Cc3c2c1)C1CCOCC1
InChI Key: InChIKey=YUFKTQXVRFYANQ-LJQANCHMSA-N
Data: 1 EC50
Activity Spreadsheet -- Enzyme Inhibition Constant Data from BindingDB
Found 1 hit for monomerid = 50384164
Trg + Lig
Ki
nM
ΔG°
kcal/mole
IC50
nM
Kd
nM
EC50/IC50
nM
koff
s-1
kon
M-1s-1
pHTemp
°C
Cannabinoid receptor 1
(Homo sapiens (Human))
BDBM50384164
(CHEMBL2029732)
Show SMILES CN(CCCC(=O)NCCF)C(=O)c1ccc2n(C)c3CC[C@H](Cc3c2c1)C1CCOCC1 |r|
Show InChI InChI=1S/C26H36FN3O3/c1-29(13-3-4-25(31)28-12-11-27)26(32)20-6-8-24-22(17-20)21-16-19(5-7-23(21)30(24)2)18-9-14-33-15-10-18/h6,8,17-19H,3-5,7,9-16H2,1-2H3,(H,28,31)/t19-/m1/s1
NCI pathway
Reactome pathway
n/an/an/an/a 12.9n/an/an/an/a
AstraZeneca
Curated by ChEMBL
Assay Description
Agonist activity at human CB1 receptor expressed in HEK293 cells assessed as [35S]GTPgamma binding
Bioorg Med Chem Lett 22: 3884-9 (2012)
Article DOI: 10.1016/j.bmcl.2012.04.128
BindingDB Entry DOI: 10.7270/Q28P61JV