BDBM50384304 CHEMBL2030665
SMILES: CC(=O)N1CCCC1(Cc1ccccc1)C1=N[C@@H](CO1)c1ccccc1
InChI Key: InChIKey=YBYWMKSMBQDBKC-AIBWNMTMSA-N
Data: 1 IC50
Activity Spreadsheet -- Enzyme Inhibition Constant Data from BindingDB
Found 1 hit for monomerid = 50384304
Trg + Lig
Ki
nM
ΔG°
kcal/mole
IC50
nM
Kd
nM
EC50/IC50
nM
koff
s-1
kon
M-1s-1
pHTemp
°C
Solute carrier family 12 member 5
(Rattus norvegicus)
BDBM50384304
(CHEMBL2030665)
Show SMILES CC(=O)N1CCCC1(Cc1ccccc1)C1=N[C@@H](CO1)c1ccccc1 |r,t:17|
Show InChI InChI=1S/C22H24N2O2/c1-17(25)24-14-8-13-22(24,15-18-9-4-2-5-10-18)21-23-20(16-26-21)19-11-6-3-7-12-19/h2-7,9-12,20H,8,13-16H2,1H3/t20-,22?/m0/s1
n/an/a 1.30E+3n/an/an/an/an/an/a
UCB Pharma
Curated by ChEMBL
Assay Description
Inhibition of rat KCC2 expressed in human Sk-Hep cells assessed as induction off Rb+ flux by atomic absorption spectroscopic analysis
Bioorg Med Chem Lett 22: 3978-82 (2012)
Article DOI: 10.1016/j.bmcl.2012.04.097
BindingDB Entry DOI: 10.7270/Q27P90FX