BDBM50384307 CHEMBL2030669
SMILES: Brc1ccc2oc(=O)c(cc2c1)C(=O)N1CCN(Cc2ccccc2)CC1
InChI Key: InChIKey=YLPNMGQEJSGGBT-UHFFFAOYSA-N
Data: 1 IC50
Activity Spreadsheet -- Enzyme Inhibition Constant Data from BindingDB
Found 1 hit for monomerid = 50384307
Trg + Lig
Ki
nM
ΔG°
kcal/mole
IC50
nM
Kd
nM
EC50/IC50
nM
koff
s-1
kon
M-1s-1
pHTemp
°C
Solute carrier family 12 member 5
(Rattus norvegicus)
BDBM50384307
(CHEMBL2030669)
Show SMILES Brc1ccc2oc(=O)c(cc2c1)C(=O)N1CCN(Cc2ccccc2)CC1
Show InChI InChI=1S/C21H19BrN2O3/c22-17-6-7-19-16(12-17)13-18(21(26)27-19)20(25)24-10-8-23(9-11-24)14-15-4-2-1-3-5-15/h1-7,12-13H,8-11,14H2
n/an/a 600n/an/an/an/an/an/a
UCB Pharma
Curated by ChEMBL
Assay Description
Inhibition of rat KCC2 expressed in human Sk-Hep cells assessed as induction off Rb+ flux by atomic absorption spectroscopic analysis
Bioorg Med Chem Lett 22: 3978-82 (2012)
Article DOI: 10.1016/j.bmcl.2012.04.097
BindingDB Entry DOI: 10.7270/Q27P90FX