BDBM50384358 CHEMBL2031027::US9346795, 92
SMILES: CCCCN(CCCC)C(=O)c1nn(c(C)c1Cl)-c1ccc(cc1C(=O)N1Cc2ccccc2C[C@H]1CN)C(=O)NS(=O)(=O)c1ccc2ccccc2c1
InChI Key: InChIKey=RDUZUQBPRJAAOZ-XIFFEERXSA-N
Data: 4 IC50
Activity Spreadsheet -- Enzyme Inhibition Constant Data from BindingDB
Found 4 hits for monomerid = 50384358
Trg + Lig
Ki
nM
ΔG°
kcal/mole
IC50
nM
Kd
nM
EC50/IC50
nM
koff
s-1
kon
M-1s-1
pHTemp
°C
Apoptosis regulator Bcl-2
(Homo sapiens (Human))
BDBM50384358
(CHEMBL2031027 | US9346795, 92)
Show SMILES CCCCN(CCCC)C(=O)c1nn(c(C)c1Cl)-c1ccc(cc1C(=O)N1Cc2ccccc2C[C@H]1CN)C(=O)NS(=O)(=O)c1ccc2ccccc2c1 |r|
Show InChI InChI=1S/C41H45ClN6O5S/c1-4-6-20-46(21-7-5-2)41(51)38-37(42)27(3)48(44-38)36-19-17-31(39(49)45-54(52,53)34-18-16-28-12-8-9-14-30(28)23-34)24-35(36)40(50)47-26-32-15-11-10-13-29(32)22-33(47)25-43/h8-19,23-24,33H,4-7,20-22,25-26,43H2,1-3H3,(H,45,49)/t33-/m0/s1
US Patent
n/an/a 8.41n/an/an/an/an/a25
Bristol-Myers Squibb Company
US Patent
Assay Description
The assays were performed in black flat-bottom 384-well plates. The final assay volume was 50 μl prepared from additions of Gst-Bcl-2 (Bcl-2: GE...
US Patent US9346795 (2016)
BindingDB Entry DOI: 10.7270/Q2SF2V27
Bcl-2-like protein 1
(Homo sapiens (Human))
BDBM50384358
(CHEMBL2031027 | US9346795, 92)
Show SMILES CCCCN(CCCC)C(=O)c1nn(c(C)c1Cl)-c1ccc(cc1C(=O)N1Cc2ccccc2C[C@H]1CN)C(=O)NS(=O)(=O)c1ccc2ccccc2c1 |r|
Show InChI InChI=1S/C41H45ClN6O5S/c1-4-6-20-46(21-7-5-2)41(51)38-37(42)27(3)48(44-38)36-19-17-31(39(49)45-54(52,53)34-18-16-28-12-8-9-14-30(28)23-34)24-35(36)40(50)47-26-32-15-11-10-13-29(32)22-33(47)25-43/h8-19,23-24,33H,4-7,20-22,25-26,43H2,1-3H3,(H,45,49)/t33-/m0/s1
NCI pathway
Reactome pathway
n/an/a 10n/an/an/an/an/an/a
Bristol-Myers Squibb Research
Curated by ChEMBL
Assay Description
Inhibition of Bcl-XL using fluoresceinated 18-mer Bim as substrate after 60 mins by FRET analysis
Bioorg Med Chem Lett 22: 3946-50 (2012)
Article DOI: 10.1016/j.bmcl.2012.04.103
BindingDB Entry DOI: 10.7270/Q20866BM
Apoptosis regulator Bcl-2
(Homo sapiens (Human))
BDBM50384358
(CHEMBL2031027 | US9346795, 92)
Show SMILES CCCCN(CCCC)C(=O)c1nn(c(C)c1Cl)-c1ccc(cc1C(=O)N1Cc2ccccc2C[C@H]1CN)C(=O)NS(=O)(=O)c1ccc2ccccc2c1 |r|
Show InChI InChI=1S/C41H45ClN6O5S/c1-4-6-20-46(21-7-5-2)41(51)38-37(42)27(3)48(44-38)36-19-17-31(39(49)45-54(52,53)34-18-16-28-12-8-9-14-30(28)23-34)24-35(36)40(50)47-26-32-15-11-10-13-29(32)22-33(47)25-43/h8-19,23-24,33H,4-7,20-22,25-26,43H2,1-3H3,(H,45,49)/t33-/m0/s1
n/an/a 9n/an/an/an/an/an/a
Bristol-Myers Squibb Research
Curated by ChEMBL
Assay Description
Inhibition in GST-tagged Bcl2 using [FAM]-IWIAQELRRIGDEFNAYY-NH2 as substrate after 60 mins by fluorescence polarization assay
Bioorg Med Chem Lett 22: 3946-50 (2012)
Article DOI: 10.1016/j.bmcl.2012.04.103
BindingDB Entry DOI: 10.7270/Q20866BM
Bcl-2-like protein 1
(Homo sapiens (Human))
BDBM50384358
(CHEMBL2031027 | US9346795, 92)
Show SMILES CCCCN(CCCC)C(=O)c1nn(c(C)c1Cl)-c1ccc(cc1C(=O)N1Cc2ccccc2C[C@H]1CN)C(=O)NS(=O)(=O)c1ccc2ccccc2c1 |r|
Show InChI InChI=1S/C41H45ClN6O5S/c1-4-6-20-46(21-7-5-2)41(51)38-37(42)27(3)48(44-38)36-19-17-31(39(49)45-54(52,53)34-18-16-28-12-8-9-14-30(28)23-34)24-35(36)40(50)47-26-32-15-11-10-13-29(32)22-33(47)25-43/h8-19,23-24,33H,4-7,20-22,25-26,43H2,1-3H3,(H,45,49)/t33-/m0/s1
NCI pathway
Reactome pathway
US Patent
n/an/a 10n/an/an/an/an/a25
Bristol-Myers Squibb Company
US Patent
Assay Description
The assays were performed in black flat-bottom 384-well plates. The final assay volume was 55 μl prepared from additions of Biotin-Bcl-xL (Bcl-x...
US Patent US9346795 (2016)
BindingDB Entry DOI: 10.7270/Q2SF2V27