BDBM50384451 CHEMBL2035738
SMILES: C\C(CCn1cc(CCOC2CCCCO2)nn1)=C/CSCCC(O)=O
InChI Key: InChIKey=QVOXNUIXSYHXAX-VIZOYTHASA-N
Data: 1 IC50
Activity Spreadsheet -- Enzyme Inhibition Constant Data from BindingDB
Found 1 hit for monomerid = 50384451
Trg + Lig
Ki
nM
ΔG°
kcal/mole
IC50
nM
Kd
nM
EC50/IC50
nM
koff
s-1
kon
M-1s-1
pHTemp
°C
Isoprenylcysteine carboxyl methyltransferase
(Homo sapiens (Human))
BDBM50384451
(CHEMBL2035738)
Show SMILES C\C(CCn1cc(CCOC2CCCCO2)nn1)=C/CSCCC(O)=O
Show InChI InChI=1S/C18H29N3O4S/c1-15(7-12-26-13-8-17(22)23)5-9-21-14-16(19-20-21)6-11-25-18-4-2-3-10-24-18/h7,14,18H,2-6,8-13H2,1H3,(H,22,23)/b15-7+
n/an/a>1.00E+5n/an/an/an/an/an/a
TBA
Curated by ChEMBL
Assay Description
Inhibition of ICMT in cell free system
ACS Med Chem Lett 3: 15-19 (2012)
Article DOI: 10.1021/ml200106d
BindingDB Entry DOI: 10.7270/Q26T0NPK