BDBM50384723 CHEMBL2037222
SMILES: CN1CCN(CC1)c1cc(cc(c1)C(F)(F)F)C(=O)Nc1cccc(Nc2ccc3\C(=C\c4[nH]c(C)c(C(O)=O)c4C)C(=O)Nc3c2)c1
InChI Key: InChIKey=LGVBHZJPCVEXMU-VEILYXNESA-N
Data: 1 IC50
Activity Spreadsheet -- Enzyme Inhibition Constant Data from BindingDB
Found 1 hit for monomerid = 50384723
Trg + Lig
Ki
nM
ΔG°
kcal/mole
IC50
nM
Kd
nM
EC50/IC50
nM
koff
s-1
kon
M-1s-1
pHTemp
°C
High affinity nerve growth factor receptor
(Homo sapiens (Human))
BDBM50384723
(CHEMBL2037222)
Show SMILES CN1CCN(CC1)c1cc(cc(c1)C(F)(F)F)C(=O)Nc1cccc(Nc2ccc3\C(=C\c4[nH]c(C)c(C(O)=O)c4C)C(=O)Nc3c2)c1
Show InChI InChI=1S/C35H33F3N6O4/c1-19-29(39-20(2)31(19)34(47)48)18-28-27-8-7-25(17-30(27)42-33(28)46)40-23-5-4-6-24(16-23)41-32(45)21-13-22(35(36,37)38)15-26(14-21)44-11-9-43(3)10-12-44/h4-8,13-18,39-40H,9-12H2,1-3H3,(H,41,45)(H,42,46)(H,47,48)/b28-18-
n/an/a 9n/an/an/an/an/an/a
TBA
Curated by ChEMBL
Assay Description
Inhibition of TRKA by HTRF assay
ACS Med Chem Lett 3: 140-145 (2012)
Article DOI: 10.1021/ml200261d
BindingDB Entry DOI: 10.7270/Q2SJ1MNM