BDBM50384728 CHEMBL2037218
SMILES: CN1CCN(CC1)c1cc(cc(c1)C(F)(F)F)C(=O)Nc1cccc(Nc2ccc3\C(=C\c4cc(c[nH]4)C#N)C(=O)Nc3c2)c1
InChI Key: InChIKey=YNADGIAXXBCSQT-MWLSYYOVSA-N
Data: 1 IC50
Activity Spreadsheet -- Enzyme Inhibition Constant Data from BindingDB
Found 1 hit for monomerid = 50384728
Trg + Lig
Ki
nM
ΔG°
kcal/mole
IC50
nM
Kd
nM
EC50/IC50
nM
koff
s-1
kon
M-1s-1
pHTemp
°C
BDNF/NT-3 growth factors receptor
(Homo sapiens (Human))
BDBM50384728
(CHEMBL2037218)
Show SMILES CN1CCN(CC1)c1cc(cc(c1)C(F)(F)F)C(=O)Nc1cccc(Nc2ccc3\C(=C\c4cc(c[nH]4)C#N)C(=O)Nc3c2)c1
Show InChI InChI=1S/C33H28F3N7O2/c1-42-7-9-43(10-8-42)27-13-21(12-22(14-27)33(34,35)36)31(44)40-24-4-2-3-23(15-24)39-25-5-6-28-29(32(45)41-30(28)17-25)16-26-11-20(18-37)19-38-26/h2-6,11-17,19,38-39H,7-10H2,1H3,(H,40,44)(H,41,45)/b29-16-
n/an/a 27n/an/an/an/an/an/a
TBA
Curated by ChEMBL
Assay Description
Inhibition of TRKB by HTRF assay
ACS Med Chem Lett 3: 140-145 (2012)
Article DOI: 10.1021/ml200261d
BindingDB Entry DOI: 10.7270/Q2SJ1MNM