BDBM50384765 CHEMBL2037363
SMILES: CCCCn1sc(=O)n(CCCC)c1=O
InChI Key: InChIKey=WXPYTMMRDMUNOR-UHFFFAOYSA-N
Data: 4 IC50
Activity Spreadsheet -- Enzyme Inhibition Constant Data from BindingDB
Found 4 hits for monomerid = 50384765
Trg + Lig
Ki
nM
ΔG°
kcal/mole
IC50
nM
Kd
nM
EC50/IC50
nM
koff
s-1
kon
M-1s-1
pHTemp
°C
Regulator of G-protein signaling 4 (RGS4)
(Homo sapiens (Human))
BDBM50384765
(CHEMBL2037363)
Show SMILES CCCCn1sc(=O)n(CCCC)c1=O
Show InChI InChI=1S/C10H18N2O2S/c1-3-5-7-11-9(13)12(8-6-4-2)15-10(11)14/h3-8H2,1-2H3
n/an/a 30n/an/an/an/an/an/a
TBA
Curated by ChEMBL
Assay Description
Inhibition of RGS4 interaction with Galpha0 protein by flow cytometry protein interaction assay
ACS Med Chem Lett 3: 146-150 (2012)
Article DOI: 10.1021/ml200263y
BindingDB Entry DOI: 10.7270/Q2NS0VXW
Sortase A (SrtA)
(Staphylococcus aureus)
BDBM50384765
(CHEMBL2037363)
Show SMILES CCCCn1sc(=O)n(CCCC)c1=O
Show InChI InChI=1S/C10H18N2O2S/c1-3-5-7-11-9(13)12(8-6-4-2)15-10(11)14/h3-8H2,1-2H3
n/an/a>5.00E+4n/an/an/an/an/an/a
Guizhou University
Curated by ChEMBL
Assay Description
Inhibition of Staphylococcus aureus SrtA delta N24 mutant expressed in Escherichia coli BL21 (DE3) assessed as reduction in IsdA (64 to 323 residues)...
J Med Chem 63: 8442-8457 (2020)
Sortase A (SrtA)
(Staphylococcus aureus)
BDBM50384765
(CHEMBL2037363)
Show SMILES CCCCn1sc(=O)n(CCCC)c1=O
Show InChI InChI=1S/C10H18N2O2S/c1-3-5-7-11-9(13)12(8-6-4-2)15-10(11)14/h3-8H2,1-2H3
n/an/a 4.39E+4n/an/an/an/an/an/a
Guizhou University
Curated by ChEMBL
Assay Description
Inhibition of Staphylococcus aureus SrtA delta N24 mutant expressed in Escherichia coli BL21 (DE3) using Abz-LPATG-Dnp substrate incubated for 20 min...
J Med Chem 63: 8442-8457 (2020)
Regulator of G-protein signaling 8
(Homo sapiens (Human))
BDBM50384765
(CHEMBL2037363)
Show SMILES CCCCn1sc(=O)n(CCCC)c1=O
Show InChI InChI=1S/C10H18N2O2S/c1-3-5-7-11-9(13)12(8-6-4-2)15-10(11)14/h3-8H2,1-2H3
Reactome pathway
n/an/a 1.22E+5n/an/an/an/an/an/a
TBA
Curated by ChEMBL
Assay Description
Inhibition of RGS8 interaction with Galpha0 protein by flow cytometry protein interaction assay
ACS Med Chem Lett 3: 146-150 (2012)
Article DOI: 10.1021/ml200263y
BindingDB Entry DOI: 10.7270/Q2NS0VXW