BDBM50385122 CHEMBL2036312
SMILES: O[C@@H](Cc1cccc(c1)-c1nc2ccccc2o1)\C=C\[C@H]1CCC(=O)N1CCSCCCC(O)=O
InChI Key: InChIKey=JZCFDPKIVFTNPA-PNXDNICKSA-N
Data: 4 KI  1 EC50
Activity Spreadsheet -- Enzyme Inhibition Constant Data from BindingDB
Found 5 hits for monomerid = 50385122
Trg + Lig
Ki
nM
ΔG°
kcal/mole
IC50
nM
Kd
nM
EC50/IC50
nM
koff
s-1
kon
M-1s-1
pHTemp
°C
Prostanoid EP4 Receptor
(Mus musculus (Mouse))
BDBM50385122
(CHEMBL2036312)
Show SMILES O[C@@H](Cc1cccc(c1)-c1nc2ccccc2o1)\C=C\[C@H]1CCC(=O)N1CCSCCCC(O)=O |r|
Show InChI InChI=1S/C27H30N2O5S/c30-22(12-10-21-11-13-25(31)29(21)14-16-35-15-4-9-26(32)33)18-19-5-3-6-20(17-19)27-28-23-7-1-2-8-24(23)34-27/h1-3,5-8,10,12,17,21-22,30H,4,9,11,13-16,18H2,(H,32,33)/b12-10+/t21-,22+/m0/s1
Reactome pathway
0.200n/an/an/an/an/an/an/an/a
Minase Research Institute
Curated by ChEMBL
Assay Description
Displacement of [3H]PGE2 from mouse EP4 receptor expressed in CHO cells after 60 mins by scintillation counting
Bioorg Med Chem 20: 3502-22 (2012)
Article DOI: 10.1016/j.bmc.2012.04.008
BindingDB Entry DOI: 10.7270/Q2D50P0B
Prostanoid EP2 Receptor
(Mus musculus (Mouse))
BDBM50385122
(CHEMBL2036312)
Show SMILES O[C@@H](Cc1cccc(c1)-c1nc2ccccc2o1)\C=C\[C@H]1CCC(=O)N1CCSCCCC(O)=O |r|
Show InChI InChI=1S/C27H30N2O5S/c30-22(12-10-21-11-13-25(31)29(21)14-16-35-15-4-9-26(32)33)18-19-5-3-6-20(17-19)27-28-23-7-1-2-8-24(23)34-27/h1-3,5-8,10,12,17,21-22,30H,4,9,11,13-16,18H2,(H,32,33)/b12-10+/t21-,22+/m0/s1
Reactome pathway
1.70E+3n/an/an/an/an/an/an/an/a
Minase Research Institute
Curated by ChEMBL
Assay Description
Displacement of [3H]PGE2 from mouse EP2 receptor expressed in CHO cells after 60 mins by scintillation counting
Bioorg Med Chem 20: 3502-22 (2012)
Article DOI: 10.1016/j.bmc.2012.04.008
BindingDB Entry DOI: 10.7270/Q2D50P0B
Prostanoid EP1 Receptor
(Mus musculus (Mouse))
BDBM50385122
(CHEMBL2036312)
Show SMILES O[C@@H](Cc1cccc(c1)-c1nc2ccccc2o1)\C=C\[C@H]1CCC(=O)N1CCSCCCC(O)=O |r|
Show InChI InChI=1S/C27H30N2O5S/c30-22(12-10-21-11-13-25(31)29(21)14-16-35-15-4-9-26(32)33)18-19-5-3-6-20(17-19)27-28-23-7-1-2-8-24(23)34-27/h1-3,5-8,10,12,17,21-22,30H,4,9,11,13-16,18H2,(H,32,33)/b12-10+/t21-,22+/m0/s1
Reactome pathway
5.00E+3n/an/an/an/an/an/an/an/a
Minase Research Institute
Curated by ChEMBL
Assay Description
Displacement of [3H]PGE2 from mouse EP1 receptor expressed in CHO cells after 20 mins by scintillation counting
Bioorg Med Chem 20: 3502-22 (2012)
Article DOI: 10.1016/j.bmc.2012.04.008
BindingDB Entry DOI: 10.7270/Q2D50P0B
Prostanoid EP3 Receptor
(Mus musculus (Mouse))
BDBM50385122
(CHEMBL2036312)
Show SMILES O[C@@H](Cc1cccc(c1)-c1nc2ccccc2o1)\C=C\[C@H]1CCC(=O)N1CCSCCCC(O)=O |r|
Show InChI InChI=1S/C27H30N2O5S/c30-22(12-10-21-11-13-25(31)29(21)14-16-35-15-4-9-26(32)33)18-19-5-3-6-20(17-19)27-28-23-7-1-2-8-24(23)34-27/h1-3,5-8,10,12,17,21-22,30H,4,9,11,13-16,18H2,(H,32,33)/b12-10+/t21-,22+/m0/s1
>1.00E+4n/an/an/an/an/an/an/an/a
Minase Research Institute
Curated by ChEMBL
Assay Description
Displacement of [3H]PGE2 from mouse EP3 receptor expressed in CHO cells after 60 mins by scintillation counting
Bioorg Med Chem 20: 3502-22 (2012)
Article DOI: 10.1016/j.bmc.2012.04.008
BindingDB Entry DOI: 10.7270/Q2D50P0B
Prostanoid EP4 receptor
(Rattus norvegicus)
BDBM50385122
(CHEMBL2036312)
Show SMILES O[C@@H](Cc1cccc(c1)-c1nc2ccccc2o1)\C=C\[C@H]1CCC(=O)N1CCSCCCC(O)=O |r|
Show InChI InChI=1S/C27H30N2O5S/c30-22(12-10-21-11-13-25(31)29(21)14-16-35-15-4-9-26(32)33)18-19-5-3-6-20(17-19)27-28-23-7-1-2-8-24(23)34-27/h1-3,5-8,10,12,17,21-22,30H,4,9,11,13-16,18H2,(H,32,33)/b12-10+/t21-,22+/m0/s1
Reactome pathway
n/an/an/an/a 13n/an/an/an/a
Minase Research Institute
Curated by ChEMBL
Assay Description
Agonist activity at rat EP4 receptor expressed in CHO cells assessed as cAMP production after 10 mins by radioimmunoassay
Bioorg Med Chem 20: 3502-22 (2012)
Article DOI: 10.1016/j.bmc.2012.04.008
BindingDB Entry DOI: 10.7270/Q2D50P0B