BDBM50385265 CHEMBL2035293
SMILES: OB(O)CNC(=O)Cc1ccccc1[N+]([O-])=O
InChI Key: InChIKey=RBAGLZAUGSLGKC-UHFFFAOYSA-N
Data: 1 IC50
Activity Spreadsheet -- Enzyme Inhibition Constant Data from BindingDB
Found 1 hit for monomerid = 50385265
Trg + Lig
Ki
nM
ΔG°
kcal/mole
IC50
nM
Kd
nM
EC50/IC50
nM
koff
s-1
kon
M-1s-1
pHTemp
°C
Penicillin-binding protein 2X
(Streptococcus pneumoniae R6)
BDBM50385265
(CHEMBL2035293)
Show SMILES OB(O)CNC(=O)Cc1ccccc1[N+]([O-])=O
Show InChI InChI=1S/C9H11BN2O5/c13-9(11-6-10(14)15)5-7-3-1-2-4-8(7)12(16)17/h1-4,14-15H,5-6H2,(H,11,13)
n/an/a 3.39E+5n/an/an/an/an/an/a
Universit£ de Li£ge
Curated by ChEMBL
Assay Description
Inhibition of penicillin-sensitive Streptococcus pneumoniae R6 PBP2x using S2d as substrate incubated for 60 mins prior to substrate addition by DTNB...
Bioorg Med Chem 20: 3915-24 (2012)
Article DOI: 10.1016/j.bmc.2012.04.018
BindingDB Entry DOI: 10.7270/Q200034N