BDBM50385270 CHEMBL2035291
SMILES: OB(O)CNC(=O)c1ccccc1F
InChI Key: InChIKey=HNASVKWMROWLED-UHFFFAOYSA-N
Data: 1 IC50
Activity Spreadsheet -- Enzyme Inhibition Constant Data from BindingDB
Found 1 hit for monomerid = 50385270
Trg + Lig
Ki
nM
ΔG°
kcal/mole
IC50
nM
Kd
nM
EC50/IC50
nM
koff
s-1
kon
M-1s-1
pHTemp
°C
D-alanyl-D-alanine carboxypeptidase
(Actinomadura sp. (strain R39))
BDBM50385270
(CHEMBL2035291)
Show SMILES OB(O)CNC(=O)c1ccccc1F
Show InChI InChI=1S/C8H9BFNO3/c10-7-4-2-1-3-6(7)8(12)11-5-9(13)14/h1-4,13-14H,5H2,(H,11,12)
n/an/a 5.05E+5n/an/an/an/an/an/a
Universit£ de Li£ge
Curated by ChEMBL
Assay Description
Inhibition of Actinomadura sp. R39 PBP using S2d as substrate incubated for 60 mins prior to substrate addition by DTNB-based spectrophotometry
Bioorg Med Chem 20: 3915-24 (2012)
Article DOI: 10.1016/j.bmc.2012.04.018
BindingDB Entry DOI: 10.7270/Q200034N