BDBM50385298 CHEMBL2035465
SMILES: O=c1n(CCCCCCCn2[se]c3ccccc3c2=O)[se]c2ccccc12
InChI Key: InChIKey=LBPVAEOIORYKIT-UHFFFAOYSA-N
Data: 1 IC50
Activity Spreadsheet -- Enzyme Inhibition Constant Data from BindingDB
Found 1 hit for monomerid = 50385298
Trg + Lig
Ki
nM
ΔG°
kcal/mole
IC50
nM
Kd
nM
EC50/IC50
nM
koff
s-1
kon
M-1s-1
pHTemp
°C
Thioredoxin reductase 1, cytoplasmic
(Rattus norvegicus)
BDBM50385298
(CHEMBL2035465)
Show SMILES O=c1n(CCCCCCCn2[se]c3ccccc3c2=O)[se]c2ccccc12
Show InChI InChI=1S/C21H22N2O2Se2/c24-20-16-10-4-6-12-18(16)26-22(20)14-8-2-1-3-9-15-23-21(25)17-11-5-7-13-19(17)27-23/h4-7,10-13H,1-3,8-9,14-15H2
n/an/a 5.85E+3n/an/an/an/an/an/a
Peking University
Curated by ChEMBL
Assay Description
Inhibition of TrxR1 in rat liver homogenate preincubated for 5 mins measured by DNTB assay
Bioorg Med Chem 20: 3816-27 (2012)
Article DOI: 10.1016/j.bmc.2012.04.033
BindingDB Entry DOI: 10.7270/Q2V69KND