BDBM50385376 CHEMBL2036377
SMILES: COc1ccc2n(Cc3ccccc3Cl)c(nc2c1)C(C)c1ccc(CC(C)C)cc1
InChI Key: InChIKey=JPEJCNWUFQHFCB-UHFFFAOYSA-N
Data: 1 IC50
Activity Spreadsheet -- Enzyme Inhibition Constant Data from BindingDB
Found 1 hit for monomerid = 50385376
Trg + Lig
Ki
nM
ΔG°
kcal/mole
IC50
nM
Kd
nM
EC50/IC50
nM
koff
s-1
kon
M-1s-1
pHTemp
°C
5-lipoxygenase/FLAP
(Homo sapiens (Human))
BDBM50385376
(CHEMBL2036377)
Show SMILES COc1ccc2n(Cc3ccccc3Cl)c(nc2c1)C(C)c1ccc(CC(C)C)cc1
Show InChI InChI=1S/C27H29ClN2O/c1-18(2)15-20-9-11-21(12-10-20)19(3)27-29-25-16-23(31-4)13-14-26(25)30(27)17-22-7-5-6-8-24(22)28/h5-14,16,18-19H,15,17H2,1-4H3
Reactome pathway
n/an/a 120n/an/an/an/an/an/a
Gazi University
Curated by ChEMBL
Assay Description
Inhibition of FLAP in A23187-stimulated human neutrophils assessed as 5-LO product formation preincubated for 15 mins measured after 10 mins
Bioorg Med Chem 20: 3728-41 (2012)
Article DOI: 10.1016/j.bmc.2012.04.048
BindingDB Entry DOI: 10.7270/Q26H4JFM