BDBM50385586 CHEMBL2042530
SMILES: OC(=O)c1cc(CCc2cnc3cncnn23)c2CCCCc2c1
InChI Key: InChIKey=NKVKYKUBNBTFAF-UHFFFAOYSA-N
Data: 1 IC50
Activity Spreadsheet -- Enzyme Inhibition Constant Data from BindingDB
Found 1 hit for monomerid = 50385586
Trg + Lig
Ki
nM
ΔG°
kcal/mole
IC50
nM
Kd
nM
EC50/IC50
nM
koff
s-1
kon
M-1s-1
pHTemp
°C
AMP deaminase 3 (hAMPD3)
(Homo sapiens (Human))
BDBM50385586
(CHEMBL2042530)
Show SMILES OC(=O)c1cc(CCc2cnc3cncnn23)c2CCCCc2c1
Show InChI InChI=1S/C18H18N4O2/c23-18(24)14-7-12-3-1-2-4-16(12)13(8-14)5-6-15-9-20-17-10-19-11-21-22(15)17/h7-11H,1-6H2,(H,23,24)
n/an/a 900n/an/an/an/an/an/a
TBA
Curated by ChEMBL
Assay Description
Inhibition of human recombinant AMPD3-1b expressed in Sf9 cells
ACS Med Chem Lett 1: 286-289 (2010)
Article DOI: 10.1021/ml100092a
BindingDB Entry DOI: 10.7270/Q2X0683X