BDBM50385651 CHEMBL2041960
SMILES: COCCCNc1cc(ccn1)-c1oc2ccccc2c(=O)c1-c1ccc(F)cc1
InChI Key: InChIKey=FIANCLIRVGODNB-UHFFFAOYSA-N
Data: 1 IC50
Activity Spreadsheet -- Enzyme Inhibition Constant Data from BindingDB
Found 1 hit for monomerid = 50385651
Trg + Lig
Ki
nM
ΔG°
kcal/mole
IC50
nM
Kd
nM
EC50/IC50
nM
koff
s-1
kon
M-1s-1
pHTemp
°C
Mitogen-activated protein kinase 14
(Homo sapiens (Human))
BDBM50385651
(CHEMBL2041960)
Show SMILES COCCCNc1cc(ccn1)-c1oc2ccccc2c(=O)c1-c1ccc(F)cc1
Show InChI InChI=1S/C24H21FN2O3/c1-29-14-4-12-26-21-15-17(11-13-27-21)24-22(16-7-9-18(25)10-8-16)23(28)19-5-2-3-6-20(19)30-24/h2-3,5-11,13,15H,4,12,14H2,1H3,(H,26,27)
NCI pathway
Reactome pathway
n/an/a 39n/an/an/an/an/an/a
University of Gothenburg
Curated by ChEMBL
Assay Description
Inhibition of p38alpha MAPK after 40 mins by scintillation counting
J Med Chem 54: 7427-31 (2011)
Article DOI: 10.1021/jm200818j
BindingDB Entry DOI: 10.7270/Q2R78G7T