null
SMILES: CC(C)(C)Oc1cccc2nc(N)nc(N)c12
InChI Key: InChIKey=JQHKDYFLRJIBLX-UHFFFAOYSA-N
Activity Spreadsheet -- Enzyme Inhibition Constant Data from BindingDB
Found 1 hit for monomerid = 50385959
Trg + Lig
Ki
nM
ΔG°
kcal/mole
IC50
nM
Kd
nM
EC50/IC50
nM
koff
s-1
kon
M-1s-1
pHTemp
°C
Potassium voltage-gated channel subfamily H member 2
(Homo sapiens (Human))
BDBM50385959
(CHEMBL2042321)
Show SMILES CC(C)(C)Oc1cccc2nc(N)nc(N)c12
Show InChI InChI=1S/C12H16N4O/c1-12(2,3)17-8-6-4-5-7-9(8)10(13)16-11(14)15-7/h4-6H,1-3H3,(H4,13,14,15,16)
Reactome pathway
n/an/a 2.02E+4n/an/an/an/an/an/a
Chinese Academy of Sciences
Curated by ChEMBL
Assay Description
Inhibition of human ERG expressed in HEK293 cells by patch clamp assay
J Med Chem 55: 3135-43 (2012)
Article DOI: 10.1021/jm2015952
BindingDB Entry DOI: 10.7270/Q2B27WB9