BDBM50385966 CHEMBL2042465
SMILES: O=c1c2ccccc2[nH]c2cc(OCc3ccccc3)ccc12
InChI Key: InChIKey=LQRVYGWBPZBLIC-UHFFFAOYSA-N
Data: 2 KI  2 IC50
Activity Spreadsheet -- Enzyme Inhibition Constant Data from BindingDB
Found 4 hits for monomerid = 50385966
Trg + Lig
Ki
nM
ΔG°
kcal/mole
IC50
nM
Kd
nM
EC50/IC50
nM
koff
s-1
kon
M-1s-1
pHTemp
°C
Procathepsin L
(Homo sapiens (Human))
BDBM50385966
(CHEMBL2042465)
Show SMILES O=c1c2ccccc2[nH]c2cc(OCc3ccccc3)ccc12
Show InChI InChI=1S/C20H15NO2/c22-20-16-8-4-5-9-18(16)21-19-12-15(10-11-17(19)20)23-13-14-6-2-1-3-7-14/h1-12H,13H2,(H,21,22)
Reactome pathway
900n/an/an/an/an/an/an/an/a
Universidade Federal de S£o Carlos
Curated by ChEMBL
Assay Description
Competitive inhibition of human recombinant cathepsin L expressed in Pichia pastoris using Z-Phe-Arg-MCA as substrate by Lineweaver-Burk plot analysi...
Eur J Med Chem 54: 10-21 (2012)
Article DOI: 10.1016/j.ejmech.2012.04.002
BindingDB Entry DOI: 10.7270/Q22J6CW7
Cathepsin L2
(Homo sapiens (Human))
BDBM50385966
(CHEMBL2042465)
Show SMILES O=c1c2ccccc2[nH]c2cc(OCc3ccccc3)ccc12
Show InChI InChI=1S/C20H15NO2/c22-20-16-8-4-5-9-18(16)21-19-12-15(10-11-17(19)20)23-13-14-6-2-1-3-7-14/h1-12H,13H2,(H,21,22)
1.30E+3n/an/an/an/an/an/an/an/a
Universidade Federal de S£o Carlos
Curated by ChEMBL
Assay Description
Competitive inhibition of human recombinant cathepsin V expressed in Pichia pastoris using Z-Phe-Arg-MCA as substrate by Lineweaver-Burk plot analysi...
Eur J Med Chem 54: 10-21 (2012)
Article DOI: 10.1016/j.ejmech.2012.04.002
BindingDB Entry DOI: 10.7270/Q22J6CW7
Procathepsin L
(Homo sapiens (Human))
BDBM50385966
(CHEMBL2042465)
Show SMILES O=c1c2ccccc2[nH]c2cc(OCc3ccccc3)ccc12
Show InChI InChI=1S/C20H15NO2/c22-20-16-8-4-5-9-18(16)21-19-12-15(10-11-17(19)20)23-13-14-6-2-1-3-7-14/h1-12H,13H2,(H,21,22)
Reactome pathway
n/an/a 3.90E+3n/an/an/an/an/an/a
Universidade Federal de S£o Carlos
Curated by ChEMBL
Assay Description
Inhibition of human recombinant cathepsin L expressed in Pichia pastoris using Z-Phe-Arg-MCA as substrate by fluorometric analysis
Eur J Med Chem 54: 10-21 (2012)
Article DOI: 10.1016/j.ejmech.2012.04.002
BindingDB Entry DOI: 10.7270/Q22J6CW7
Cathepsin L2
(Homo sapiens (Human))
BDBM50385966
(CHEMBL2042465)
Show SMILES O=c1c2ccccc2[nH]c2cc(OCc3ccccc3)ccc12
Show InChI InChI=1S/C20H15NO2/c22-20-16-8-4-5-9-18(16)21-19-12-15(10-11-17(19)20)23-13-14-6-2-1-3-7-14/h1-12H,13H2,(H,21,22)
n/an/a 3.60E+3n/an/an/an/an/an/a
Universidade Federal de S£o Carlos
Curated by ChEMBL
Assay Description
Inhibition of human recombinant cathepsin V expressed in Pichia pastoris using Z-Phe-Arg-MCA as substrate by fluorometric analysis
Eur J Med Chem 54: 10-21 (2012)
Article DOI: 10.1016/j.ejmech.2012.04.002
BindingDB Entry DOI: 10.7270/Q22J6CW7