BDBM50385977 CHEMBL2042446
SMILES: CCCCc1ccc(cc1)-c1cc(O)c2ccccc2n1
InChI Key: InChIKey=IUAHTDMRRTZBNE-UHFFFAOYSA-N
Data: 2 KI  2 IC50
Activity Spreadsheet -- Enzyme Inhibition Constant Data from BindingDB
Found 4 hits for monomerid = 50385977
Trg + Lig
Ki
nM
ΔG°
kcal/mole
IC50
nM
Kd
nM
EC50/IC50
nM
koff
s-1
kon
M-1s-1
pHTemp
°C
Cathepsin L2
(Homo sapiens (Human))
BDBM50385977
(CHEMBL2042446)
Show SMILES CCCCc1ccc(cc1)-c1cc(O)c2ccccc2n1
Show InChI InChI=1S/C19H19NO/c1-2-3-6-14-9-11-15(12-10-14)18-13-19(21)16-7-4-5-8-17(16)20-18/h4-5,7-13H,2-3,6H2,1H3,(H,20,21)
800n/an/an/an/an/an/an/an/a
Universidade Federal de S£o Carlos
Curated by ChEMBL
Assay Description
Noncompetitive inhibition of human recombinant cathepsin V expressed in Pichia pastoris using Z-Phe-Arg-MCA as substrate by Lineweaver-Burk plot anal...
Eur J Med Chem 54: 10-21 (2012)
Article DOI: 10.1016/j.ejmech.2012.04.002
BindingDB Entry DOI: 10.7270/Q22J6CW7
Procathepsin L
(Homo sapiens (Human))
BDBM50385977
(CHEMBL2042446)
Show SMILES CCCCc1ccc(cc1)-c1cc(O)c2ccccc2n1
Show InChI InChI=1S/C19H19NO/c1-2-3-6-14-9-11-15(12-10-14)18-13-19(21)16-7-4-5-8-17(16)20-18/h4-5,7-13H,2-3,6H2,1H3,(H,20,21)
Reactome pathway
1.50E+3n/an/an/an/an/an/an/an/a
Universidade Federal de S£o Carlos
Curated by ChEMBL
Assay Description
Noncompetitive inhibition of human recombinant cathepsin L expressed in Pichia pastoris using Z-Phe-Arg-MCA as substrate by Lineweaver-Burk plot anal...
Eur J Med Chem 54: 10-21 (2012)
Article DOI: 10.1016/j.ejmech.2012.04.002
BindingDB Entry DOI: 10.7270/Q22J6CW7
Cathepsin L2
(Homo sapiens (Human))
BDBM50385977
(CHEMBL2042446)
Show SMILES CCCCc1ccc(cc1)-c1cc(O)c2ccccc2n1
Show InChI InChI=1S/C19H19NO/c1-2-3-6-14-9-11-15(12-10-14)18-13-19(21)16-7-4-5-8-17(16)20-18/h4-5,7-13H,2-3,6H2,1H3,(H,20,21)
n/an/a 5.20E+3n/an/an/an/an/an/a
Universidade Federal de S£o Carlos
Curated by ChEMBL
Assay Description
Inhibition of human recombinant cathepsin V expressed in Pichia pastoris using Z-Phe-Arg-MCA as substrate by fluorometric analysis
Eur J Med Chem 54: 10-21 (2012)
Article DOI: 10.1016/j.ejmech.2012.04.002
BindingDB Entry DOI: 10.7270/Q22J6CW7
Procathepsin L
(Homo sapiens (Human))
BDBM50385977
(CHEMBL2042446)
Show SMILES CCCCc1ccc(cc1)-c1cc(O)c2ccccc2n1
Show InChI InChI=1S/C19H19NO/c1-2-3-6-14-9-11-15(12-10-14)18-13-19(21)16-7-4-5-8-17(16)20-18/h4-5,7-13H,2-3,6H2,1H3,(H,20,21)
Reactome pathway
n/an/a 1.60E+3n/an/an/an/an/an/a
Universidade Federal de S£o Carlos
Curated by ChEMBL
Assay Description
Inhibition of human recombinant cathepsin L expressed in Pichia pastoris using Z-Phe-Arg-MCA as substrate by fluorometric analysis
Eur J Med Chem 54: 10-21 (2012)
Article DOI: 10.1016/j.ejmech.2012.04.002
BindingDB Entry DOI: 10.7270/Q22J6CW7