null
SMILES: CN(Cc1ccccc1)C(=O)c1cc2c(Cc3ccc(Cl)cc3)n[nH]c2cc1O
InChI Key: InChIKey=KDTBSDIWWLRHEI-UHFFFAOYSA-N
Activity Spreadsheet -- Enzyme Inhibition Constant Data from BindingDB
Found 1 hit for monomerid = 50386035
Trg + Lig
Ki
nM
ΔG°
kcal/mole
IC50
nM
Kd
nM
EC50/IC50
nM
koff
s-1
kon
M-1s-1
pHTemp
°C
Heat shock protein HSP 90-beta
(Homo sapiens (Human))
BDBM50386035
(CHEMBL2042874)
Show SMILES CN(Cc1ccccc1)C(=O)c1cc2c(Cc3ccc(Cl)cc3)n[nH]c2cc1O
Show InChI InChI=1S/C23H20ClN3O2/c1-27(14-16-5-3-2-4-6-16)23(29)19-12-18-20(25-26-21(18)13-22(19)28)11-15-7-9-17(24)10-8-15/h2-10,12-13,28H,11,14H2,1H3,(H,25,26)
Reactome pathway
n/an/a 5.70E+3n/an/an/an/an/an/a
Merck Serono Research
Curated by ChEMBL
Assay Description
Displacement of [3H]17AAG from human recombinant Hsp90 after 30 mins by beta scintillation counting
Bioorg Med Chem Lett 22: 4396-403 (2012)
Article DOI: 10.1016/j.bmcl.2012.04.121
BindingDB Entry DOI: 10.7270/Q2T154QC