BDBM50386121 CHEMBL2042202
SMILES: CC(C)[C@H](NC(=O)c1ncc(o1)-c1ccc(NC(=O)Nc2ccccc2Cl)cc1)C(O)=O
InChI Key: InChIKey=HOQXUHNHVMJHKQ-SFHVURJKSA-N
Data: 1 IC50
Activity Spreadsheet -- Enzyme Inhibition Constant Data from BindingDB
Found 1 hit for monomerid = 50386121
Trg + Lig
Ki
nM
ΔG°
kcal/mole
IC50
nM
Kd
nM
EC50/IC50
nM
koff
s-1
kon
M-1s-1
pHTemp
°C
Chondroitin sulfate N-acetylgalactosaminyltransferase 1
(Homo sapiens (Human))
BDBM50386121
(CHEMBL2042202)
Show SMILES CC(C)[C@H](NC(=O)c1ncc(o1)-c1ccc(NC(=O)Nc2ccccc2Cl)cc1)C(O)=O |r|
Show InChI InChI=1S/C22H21ClN4O5/c1-12(2)18(21(29)30)27-19(28)20-24-11-17(32-20)13-7-9-14(10-8-13)25-22(31)26-16-6-4-3-5-15(16)23/h3-12,18H,1-2H3,(H,27,28)(H,29,30)(H2,25,26,31)/t18-/m0/s1
Reactome pathway
n/an/a 2.82E+5n/an/an/an/an/an/a
Piramal Healthcare Limited
Curated by ChEMBL
Assay Description
Inhibition of human DGAT1 assessed as conversion of [14C]-oleoyl-CoA to [14C]-triglyceride after 10 mins by scintillation counting
Eur J Med Chem 54: 324-42 (2012)
Article DOI: 10.1016/j.ejmech.2012.05.016
BindingDB Entry DOI: 10.7270/Q25B03HK