BDBM50386122 CHEMBL2042204
SMILES: CC(C)[C@H](NC(=O)c1cc(no1)-c1ccc(NC(=O)Nc2cccc(Cl)c2)cc1)C(O)=O
InChI Key: InChIKey=SAQIRRCZDRWIQB-IBGZPJMESA-N
Data: 1 IC50
Activity Spreadsheet -- Enzyme Inhibition Constant Data from BindingDB
Found 1 hit for monomerid = 50386122
Trg + Lig
Ki
nM
ΔG°
kcal/mole
IC50
nM
Kd
nM
EC50/IC50
nM
koff
s-1
kon
M-1s-1
pHTemp
°C
Chondroitin sulfate N-acetylgalactosaminyltransferase 1
(Homo sapiens (Human))
BDBM50386122
(CHEMBL2042204)
Show SMILES CC(C)[C@H](NC(=O)c1cc(no1)-c1ccc(NC(=O)Nc2cccc(Cl)c2)cc1)C(O)=O |r|
Show InChI InChI=1S/C22H21ClN4O5/c1-12(2)19(21(29)30)26-20(28)18-11-17(27-32-18)13-6-8-15(9-7-13)24-22(31)25-16-5-3-4-14(23)10-16/h3-12,19H,1-2H3,(H,26,28)(H,29,30)(H2,24,25,31)/t19-/m0/s1
Reactome pathway
n/an/a 4.50E+4n/an/an/an/an/an/a
Piramal Healthcare Limited
Curated by ChEMBL
Assay Description
Inhibition of human DGAT1 assessed as conversion of [14C]-oleoyl-CoA to [14C]-triglyceride after 10 mins by scintillation counting
Eur J Med Chem 54: 324-42 (2012)
Article DOI: 10.1016/j.ejmech.2012.05.016
BindingDB Entry DOI: 10.7270/Q25B03HK