BDBM50386135 CHEMBL2042337
SMILES: CC(C)[C@H](NC(=O)c1cc(no1)-c1ccc(NC(=O)Nc2ccccc2C)cc1)C(O)=O
InChI Key: InChIKey=CLLXMNRYMXEYEJ-FQEVSTJZSA-N
Data: 1 IC50
Activity Spreadsheet -- Enzyme Inhibition Constant Data from BindingDB
Found 1 hit for monomerid = 50386135
Trg + Lig
Ki
nM
ΔG°
kcal/mole
IC50
nM
Kd
nM
EC50/IC50
nM
koff
s-1
kon
M-1s-1
pHTemp
°C
Chondroitin sulfate N-acetylgalactosaminyltransferase 1
(Homo sapiens (Human))
BDBM50386135
(CHEMBL2042337)
Show SMILES CC(C)[C@H](NC(=O)c1cc(no1)-c1ccc(NC(=O)Nc2ccccc2C)cc1)C(O)=O |r|
Show InChI InChI=1S/C23H24N4O5/c1-13(2)20(22(29)30)26-21(28)19-12-18(27-32-19)15-8-10-16(11-9-15)24-23(31)25-17-7-5-4-6-14(17)3/h4-13,20H,1-3H3,(H,26,28)(H,29,30)(H2,24,25,31)/t20-/m0/s1
Reactome pathway
n/an/a 8.40E+4n/an/an/an/an/an/a
Piramal Healthcare Limited
Curated by ChEMBL
Assay Description
Inhibition of human DGAT1 assessed as conversion of [14C]-oleoyl-CoA to [14C]-triglyceride after 10 mins by scintillation counting
Eur J Med Chem 54: 324-42 (2012)
Article DOI: 10.1016/j.ejmech.2012.05.016
BindingDB Entry DOI: 10.7270/Q25B03HK