BDBM50386140 CHEMBL2042342
SMILES: CC(C)[C@H](NC(=O)c1cc(no1)-c1ccc(NC(=O)Nc2cc(F)cc(F)c2)cc1)C(O)=O
InChI Key: InChIKey=MDLMHKPRVOSPGO-IBGZPJMESA-N
Data: 1 IC50
Activity Spreadsheet -- Enzyme Inhibition Constant Data from BindingDB
Found 1 hit for monomerid = 50386140
Trg + Lig
Ki
nM
ΔG°
kcal/mole
IC50
nM
Kd
nM
EC50/IC50
nM
koff
s-1
kon
M-1s-1
pHTemp
°C
Chondroitin sulfate N-acetylgalactosaminyltransferase 1
(Homo sapiens (Human))
BDBM50386140
(CHEMBL2042342)
Show SMILES CC(C)[C@H](NC(=O)c1cc(no1)-c1ccc(NC(=O)Nc2cc(F)cc(F)c2)cc1)C(O)=O |r|
Show InChI InChI=1S/C22H20F2N4O5/c1-11(2)19(21(30)31)27-20(29)18-10-17(28-33-18)12-3-5-15(6-4-12)25-22(32)26-16-8-13(23)7-14(24)9-16/h3-11,19H,1-2H3,(H,27,29)(H,30,31)(H2,25,26,32)/t19-/m0/s1
Reactome pathway
n/an/a 7.50E+4n/an/an/an/an/an/a
Piramal Healthcare Limited
Curated by ChEMBL
Assay Description
Inhibition of human DGAT1 assessed as conversion of [14C]-oleoyl-CoA to [14C]-triglyceride after 10 mins by scintillation counting
Eur J Med Chem 54: 324-42 (2012)
Article DOI: 10.1016/j.ejmech.2012.05.016
BindingDB Entry DOI: 10.7270/Q25B03HK