BDBM50386418 CHEMBL2047313
SMILES: COc1ccc2ccc(cc2c1)S(=O)(=O)N(Cc1ccccc1)[C@H]1CCN(Cc2ccc(s2)C(N)=N)C1=O
InChI Key: InChIKey=KKFJNRXJRRYNRJ-VWLOTQADSA-N
Data: 1 IC50
Activity Spreadsheet -- Enzyme Inhibition Constant Data from BindingDB
Found 1 hit for monomerid = 50386418
Trg + Lig
Ki
nM
ΔG°
kcal/mole
IC50
nM
Kd
nM
EC50/IC50
nM
koff
s-1
kon
M-1s-1
pHTemp
°C
Kallikrein 6
(Homo sapiens (Human))
BDBM50386418
(CHEMBL2047313)
Show SMILES COc1ccc2ccc(cc2c1)S(=O)(=O)N(Cc1ccccc1)[C@H]1CCN(Cc2ccc(s2)C(N)=N)C1=O |r|
Show InChI InChI=1S/C28H28N4O4S2/c1-36-22-9-7-20-8-11-24(16-21(20)15-22)38(34,35)32(17-19-5-3-2-4-6-19)25-13-14-31(28(25)33)18-23-10-12-26(37-23)27(29)30/h2-12,15-16,25H,13-14,17-18H2,1H3,(H3,29,30)/t25-/m0/s1
NCI pathway
n/an/a 1.50E+3n/an/an/an/an/an/a
TBA
Curated by ChEMBL
Assay Description
Inhibition of N-terminus His6-tagged human kallikrein 6 expressed in baculovirus infected insect sf9 cells using Boc-Phe-Ser-Arg-AMC as substrate by ...
ACS Med Chem Lett 3: 159-164 (2012)
Article DOI: 10.1021/ml200291e
BindingDB Entry DOI: 10.7270/Q2FN177M