null
SMILES: COc1cc(CC(N=O)C(=O)NCCS)ccc1SC
InChI Key: InChIKey=LLNOMTAMMQTLHH-UHFFFAOYSA-N
Activity Spreadsheet -- Enzyme Inhibition Constant Data from BindingDB
Found 2 hits for monomerid = 50386435
Trg + Lig
Ki
nM
ΔG°
kcal/mole
IC50
nM
Kd
nM
EC50/IC50
nM
koff
s-1
kon
M-1s-1
pHTemp
°C
Histone deacetylase 1
(Homo sapiens (Human))
BDBM50386435
(CHEMBL2047702)
Show SMILES COc1cc(CC(N=O)C(=O)NCCS)ccc1SC
Show InChI InChI=1S/C13H18N2O3S2/c1-18-11-8-9(3-4-12(11)20-2)7-10(15-17)13(16)14-5-6-19/h3-4,8,10,19H,5-7H2,1-2H3,(H,14,16)
NCI pathway
Reactome pathway
n/an/a 0.600n/an/an/an/an/an/a
Imperial College London
Curated by ChEMBL
Assay Description
Inhibition of human recombinant HDAC1 using Boc-lys(Ac)-AMC as substrate preincubated for 20 mins with substrate measured after 60 mins by fluorescen...
J Med Chem 55: 1731-50 (2012)
Article DOI: 10.1021/jm2016182
BindingDB Entry DOI: 10.7270/Q22F7PHC
Histone deacetylase 6
(Homo sapiens (Human))
BDBM50386435
(CHEMBL2047702)
Show SMILES COc1cc(CC(N=O)C(=O)NCCS)ccc1SC
Show InChI InChI=1S/C13H18N2O3S2/c1-18-11-8-9(3-4-12(11)20-2)7-10(15-17)13(16)14-5-6-19/h3-4,8,10,19H,5-7H2,1-2H3,(H,14,16)
NCI pathway
Reactome pathway
n/an/a 1.40E+3n/an/an/an/an/an/a
Imperial College London
Curated by ChEMBL
Assay Description
Inhibition of human recombinant HDAC6 using Boc-lys(Ac)-AMC as substrate preincubated for 20 mins with substrate measured after 60 mins by fluorescen...
J Med Chem 55: 1731-50 (2012)
Article DOI: 10.1021/jm2016182
BindingDB Entry DOI: 10.7270/Q22F7PHC