null
SMILES: CSc1ccc(CC(N=O)C(=O)NCCS)cc1
InChI Key: InChIKey=JCZADLYHHTWDKT-UHFFFAOYSA-N
Activity Spreadsheet -- Enzyme Inhibition Constant Data from BindingDB
Found 2 hits for monomerid = 50386439
Trg + Lig
Ki
nM
ΔG°
kcal/mole
IC50
nM
Kd
nM
EC50/IC50
nM
koff
s-1
kon
M-1s-1
pHTemp
°C
Histone deacetylase 6
(Homo sapiens (Human))
BDBM50386439
(CHEMBL2047690)
Show SMILES CSc1ccc(CC(N=O)C(=O)NCCS)cc1
Show InChI InChI=1S/C12H16N2O2S2/c1-18-10-4-2-9(3-5-10)8-11(14-16)12(15)13-6-7-17/h2-5,11,17H,6-8H2,1H3,(H,13,15)
NCI pathway
Reactome pathway
n/an/a 1.30E+3n/an/an/an/an/an/a
Imperial College London
Curated by ChEMBL
Assay Description
Inhibition of human recombinant HDAC6 using Boc-lys(Ac)-AMC as substrate preincubated for 20 mins with substrate measured after 60 mins by fluorescen...
J Med Chem 55: 1731-50 (2012)
Article DOI: 10.1021/jm2016182
BindingDB Entry DOI: 10.7270/Q22F7PHC
Histone deacetylase 1
(Homo sapiens (Human))
BDBM50386439
(CHEMBL2047690)
Show SMILES CSc1ccc(CC(N=O)C(=O)NCCS)cc1
Show InChI InChI=1S/C12H16N2O2S2/c1-18-10-4-2-9(3-5-10)8-11(14-16)12(15)13-6-7-17/h2-5,11,17H,6-8H2,1H3,(H,13,15)
NCI pathway
Reactome pathway
n/an/a 2n/an/an/an/an/an/a
Imperial College London
Curated by ChEMBL
Assay Description
Inhibition of human recombinant HDAC1 using Boc-lys(Ac)-AMC as substrate preincubated for 20 mins with substrate measured after 60 mins by fluorescen...
J Med Chem 55: 1731-50 (2012)
Article DOI: 10.1021/jm2016182
BindingDB Entry DOI: 10.7270/Q22F7PHC