BDBM50386454 CHEMBL1818136
SMILES: CSCCNC(=O)C(Cc1ccc(O)c(Br)c1)N=O
InChI Key: InChIKey=UUNUNEUYZUZAFA-UHFFFAOYSA-N
Data: 2 IC50
Activity Spreadsheet -- Enzyme Inhibition Constant Data from BindingDB
Found 2 hits for monomerid = 50386454
Trg + Lig
Ki
nM
ΔG°
kcal/mole
IC50
nM
Kd
nM
EC50/IC50
nM
koff
s-1
kon
M-1s-1
pHTemp
°C
Histone deacetylase 1
(Homo sapiens (Human))
BDBM50386454
(CHEMBL1818136)
Show SMILES CSCCNC(=O)C(Cc1ccc(O)c(Br)c1)N=O
Show InChI InChI=1S/C12H15BrN2O3S/c1-19-5-4-14-12(17)10(15-18)7-8-2-3-11(16)9(13)6-8/h2-3,6,10,16H,4-5,7H2,1H3,(H,14,17)
NCI pathway
Reactome pathway
n/an/a 7.70E+3n/an/an/an/an/an/a
Imperial College London
Curated by ChEMBL
Assay Description
Inhibition of human recombinant HDAC1 using Boc-lys(Ac)-AMC as substrate preincubated for 20 mins with substrate measured after 60 mins by fluorescen...
J Med Chem 55: 1731-50 (2012)
Article DOI: 10.1021/jm2016182
BindingDB Entry DOI: 10.7270/Q22F7PHC
Histone deacetylase 6
(Homo sapiens (Human))
BDBM50386454
(CHEMBL1818136)
Show SMILES CSCCNC(=O)C(Cc1ccc(O)c(Br)c1)N=O
Show InChI InChI=1S/C12H15BrN2O3S/c1-19-5-4-14-12(17)10(15-18)7-8-2-3-11(16)9(13)6-8/h2-3,6,10,16H,4-5,7H2,1H3,(H,14,17)
NCI pathway
Reactome pathway
n/an/a>5.00E+4n/an/an/an/an/an/a
Imperial College London
Curated by ChEMBL
Assay Description
Inhibition of human recombinant HDAC6 using Boc-lys(Ac)-AMC as substrate preincubated for 20 mins with substrate measured after 60 mins by fluorescen...
J Med Chem 55: 1731-50 (2012)
Article DOI: 10.1021/jm2016182
BindingDB Entry DOI: 10.7270/Q22F7PHC