null
SMILES: Oc1ccc(CC(=O)C(=O)NCCSSCCNC(=O)C(=O)Cc2ccc(O)c(Br)c2)cc1Br
InChI Key: InChIKey=BVIWGDIUFBWXNR-UHFFFAOYSA-N
Activity Spreadsheet -- Enzyme Inhibition Constant Data from BindingDB
Found 2 hits for monomerid = 50386465
Trg + Lig
Ki
nM
ΔG°
kcal/mole
IC50
nM
Kd
nM
EC50/IC50
nM
koff
s-1
kon
M-1s-1
pHTemp
°C
Histone deacetylase 1
(Homo sapiens (Human))
BDBM50386465
(CHEMBL2047673)
Show SMILES Oc1ccc(CC(=O)C(=O)NCCSSCCNC(=O)C(=O)Cc2ccc(O)c(Br)c2)cc1Br
Show InChI InChI=1S/C22H22Br2N2O6S2/c23-15-9-13(1-3-17(15)27)11-19(29)21(31)25-5-7-33-34-8-6-26-22(32)20(30)12-14-2-4-18(28)16(24)10-14/h1-4,9-10,27-28H,5-8,11-12H2,(H,25,31)(H,26,32)
NCI pathway
Reactome pathway
n/an/a 5.00E+3n/an/an/an/an/an/a
Imperial College London
Curated by ChEMBL
Assay Description
Inhibition of human recombinant HDAC1 using Boc-lys(Ac)-AMC as substrate preincubated for 20 mins with substrate measured after 60 mins by fluorescen...
J Med Chem 55: 1731-50 (2012)
Article DOI: 10.1021/jm2016182
BindingDB Entry DOI: 10.7270/Q22F7PHC
Histone deacetylase 6
(Homo sapiens (Human))
BDBM50386465
(CHEMBL2047673)
Show SMILES Oc1ccc(CC(=O)C(=O)NCCSSCCNC(=O)C(=O)Cc2ccc(O)c(Br)c2)cc1Br
Show InChI InChI=1S/C22H22Br2N2O6S2/c23-15-9-13(1-3-17(15)27)11-19(29)21(31)25-5-7-33-34-8-6-26-22(32)20(30)12-14-2-4-18(28)16(24)10-14/h1-4,9-10,27-28H,5-8,11-12H2,(H,25,31)(H,26,32)
NCI pathway
Reactome pathway
n/an/a 9.00E+3n/an/an/an/an/an/a
Imperial College London
Curated by ChEMBL
Assay Description
Inhibition of human recombinant HDAC6 using Boc-lys(Ac)-AMC as substrate preincubated for 20 mins with substrate measured after 60 mins by fluorescen...
J Med Chem 55: 1731-50 (2012)
Article DOI: 10.1021/jm2016182
BindingDB Entry DOI: 10.7270/Q22F7PHC