BDBM50386472 CHEMBL2047681
SMILES: COc1ccc(CC(=NN)C(=O)NCCS)cc1Br
InChI Key: InChIKey=JRRLYRIHLCRHDX-UHFFFAOYSA-N
Data: 2 IC50
Activity Spreadsheet -- Enzyme Inhibition Constant Data from BindingDB
Found 2 hits for monomerid = 50386472
Trg + Lig
Ki
nM
ΔG°
kcal/mole
IC50
nM
Kd
nM
EC50/IC50
nM
koff
s-1
kon
M-1s-1
pHTemp
°C
Histone deacetylase 6
(Homo sapiens (Human))
BDBM50386472
(CHEMBL2047681)
Show SMILES COc1ccc(CC(=NN)C(=O)NCCS)cc1Br |w:8.8|
Show InChI InChI=1S/C12H16BrN3O2S/c1-18-11-3-2-8(6-9(11)13)7-10(16-14)12(17)15-4-5-19/h2-3,6,19H,4-5,7,14H2,1H3,(H,15,17)
NCI pathway
Reactome pathway
n/an/a 320n/an/an/an/an/an/a
Imperial College London
Curated by ChEMBL
Assay Description
Inhibition of human recombinant HDAC6 using Boc-lys(Ac)-AMC as substrate preincubated for 20 mins with substrate measured after 60 mins by fluorescen...
J Med Chem 55: 1731-50 (2012)
Article DOI: 10.1021/jm2016182
BindingDB Entry DOI: 10.7270/Q22F7PHC
Histone deacetylase 1
(Homo sapiens (Human))
BDBM50386472
(CHEMBL2047681)
Show SMILES COc1ccc(CC(=NN)C(=O)NCCS)cc1Br |w:8.8|
Show InChI InChI=1S/C12H16BrN3O2S/c1-18-11-3-2-8(6-9(11)13)7-10(16-14)12(17)15-4-5-19/h2-3,6,19H,4-5,7,14H2,1H3,(H,15,17)
NCI pathway
Reactome pathway
n/an/a 6n/an/an/an/an/an/a
Imperial College London
Curated by ChEMBL
Assay Description
Inhibition of human recombinant HDAC1 using Boc-lys(Ac)-AMC as substrate preincubated for 20 mins with substrate measured after 60 mins by fluorescen...
J Med Chem 55: 1731-50 (2012)
Article DOI: 10.1021/jm2016182
BindingDB Entry DOI: 10.7270/Q22F7PHC