BDBM50386487 CHEMBL2048047
SMILES: CC(C)(C)c1cccc(CN[C@H]2CS(=O)(=O)C[C@@H](Cc3cc(F)c(N)c(OC(C(F)(F)F)C(F)(F)F)c3)[C@@H]2O)c1
InChI Key: InChIKey=XUPJXTGHHHIDNH-WVBUVRCRSA-N
Data: 5 IC50
Activity Spreadsheet -- Enzyme Inhibition Constant Data from BindingDB
Found 5 hits for monomerid = 50386487
Trg + Lig
Ki
nM
ΔG°
kcal/mole
IC50
nM
Kd
nM
EC50/IC50
nM
koff
s-1
kon
M-1s-1
pHTemp
°C
Beta-secretase 1
(Homo sapiens (Human))
BDBM50386487
(CHEMBL2048047)
Show SMILES CC(C)(C)c1cccc(CN[C@H]2CS(=O)(=O)C[C@@H](Cc3cc(F)c(N)c(OC(C(F)(F)F)C(F)(F)F)c3)[C@@H]2O)c1 |r|
Show InChI InChI=1S/C26H31F7N2O4S/c1-24(2,3)17-6-4-5-14(8-17)11-35-19-13-40(37,38)12-16(22(19)36)7-15-9-18(27)21(34)20(10-15)39-23(25(28,29)30)26(31,32)33/h4-6,8-10,16,19,22-23,35-36H,7,11-13,34H2,1-3H3/t16-,19+,22+/m1/s1
n/an/a 2n/an/an/an/an/an/a
Novartis Pharma AG
Curated by ChEMBL
Assay Description
Inhibition of human recombinant BACE1 ectodomain after 1 hr by fluorescence analysis
J Med Chem 55: 3364-86 (2012)
Article DOI: 10.1021/jm300069y
BindingDB Entry DOI: 10.7270/Q2P55PJW
Beta-secretase 1
(Homo sapiens (Human))
BDBM50386487
(CHEMBL2048047)
Show SMILES CC(C)(C)c1cccc(CN[C@H]2CS(=O)(=O)C[C@@H](Cc3cc(F)c(N)c(OC(C(F)(F)F)C(F)(F)F)c3)[C@@H]2O)c1 |r|
Show InChI InChI=1S/C26H31F7N2O4S/c1-24(2,3)17-6-4-5-14(8-17)11-35-19-13-40(37,38)12-16(22(19)36)7-15-9-18(27)21(34)20(10-15)39-23(25(28,29)30)26(31,32)33/h4-6,8-10,16,19,22-23,35-36H,7,11-13,34H2,1-3H3/t16-,19+,22+/m1/s1
n/an/a 55n/an/an/an/an/an/a
Novartis Pharma AG
Curated by ChEMBL
Assay Description
Inhibition of BACE-1 mediated amyloid beta 40 release in human wild type APP-transfected CHO cells by HTRF immunoassay
J Med Chem 55: 3364-86 (2012)
Article DOI: 10.1021/jm300069y
BindingDB Entry DOI: 10.7270/Q2P55PJW
Cathepsin D
(Homo sapiens (Human))
BDBM50386487
(CHEMBL2048047)
Show SMILES CC(C)(C)c1cccc(CN[C@H]2CS(=O)(=O)C[C@@H](Cc3cc(F)c(N)c(OC(C(F)(F)F)C(F)(F)F)c3)[C@@H]2O)c1 |r|
Show InChI InChI=1S/C26H31F7N2O4S/c1-24(2,3)17-6-4-5-14(8-17)11-35-19-13-40(37,38)12-16(22(19)36)7-15-9-18(27)21(34)20(10-15)39-23(25(28,29)30)26(31,32)33/h4-6,8-10,16,19,22-23,35-36H,7,11-13,34H2,1-3H3/t16-,19+,22+/m1/s1
NCI pathway
Reactome pathway
n/an/a 450n/an/an/an/an/an/a
Novartis Pharma AG
Curated by ChEMBL
Assay Description
Inhibition of human recombinant CatD using Mca-GKPILFFRLK(DNP)-dR-NH2 as substrate after 1 hr by fluorescence analysis
J Med Chem 55: 3364-86 (2012)
Article DOI: 10.1021/jm300069y
BindingDB Entry DOI: 10.7270/Q2P55PJW
Cytochrome P450 3A4
(Homo sapiens (Human))
BDBM50386487
(CHEMBL2048047)
Show SMILES CC(C)(C)c1cccc(CN[C@H]2CS(=O)(=O)C[C@@H](Cc3cc(F)c(N)c(OC(C(F)(F)F)C(F)(F)F)c3)[C@@H]2O)c1 |r|
Show InChI InChI=1S/C26H31F7N2O4S/c1-24(2,3)17-6-4-5-14(8-17)11-35-19-13-40(37,38)12-16(22(19)36)7-15-9-18(27)21(34)20(10-15)39-23(25(28,29)30)26(31,32)33/h4-6,8-10,16,19,22-23,35-36H,7,11-13,34H2,1-3H3/t16-,19+,22+/m1/s1
Reactome pathway
n/an/a 300n/an/an/an/an/an/a
Novartis Pharma AG
Curated by ChEMBL
Assay Description
Inhibition of CYP3A4
J Med Chem 55: 3364-86 (2012)
Article DOI: 10.1021/jm300069y
BindingDB Entry DOI: 10.7270/Q2P55PJW
Cathepsin D
(Homo sapiens (Human))
BDBM50386487
(CHEMBL2048047)
Show SMILES CC(C)(C)c1cccc(CN[C@H]2CS(=O)(=O)C[C@@H](Cc3cc(F)c(N)c(OC(C(F)(F)F)C(F)(F)F)c3)[C@@H]2O)c1 |r|
Show InChI InChI=1S/C26H31F7N2O4S/c1-24(2,3)17-6-4-5-14(8-17)11-35-19-13-40(37,38)12-16(22(19)36)7-15-9-18(27)21(34)20(10-15)39-23(25(28,29)30)26(31,32)33/h4-6,8-10,16,19,22-23,35-36H,7,11-13,34H2,1-3H3/t16-,19+,22+/m1/s1
NCI pathway
Reactome pathway
n/an/a 450n/an/an/an/an/an/a
Novartis Pharma AG
Curated by ChEMBL
Assay Description
Inhibition of human cathepsin-D
Bioorg Med Chem Lett 23: 5300-6 (2013)
Article DOI: 10.1016/j.bmcl.2013.07.071
BindingDB Entry DOI: 10.7270/Q2GT5PK1