BDBM50386512 CHEMBL2048050
SMILES: C[C@@H](Oc1cc(C[C@@H]2CS(=O)(=O)C[C@H](NCc3cccc(c3)C(C)(C)C)[C@H]2O)cc(F)c1N)C(F)(F)F
InChI Key: InChIKey=ULGBCGLZQYCGRH-SPCUFACSSA-N
Data: 3 IC50
Activity Spreadsheet -- Enzyme Inhibition Constant Data from BindingDB
Found 3 hits for monomerid = 50386512
Trg + Lig
Ki
nM
ΔG°
kcal/mole
IC50
nM
Kd
nM
EC50/IC50
nM
koff
s-1
kon
M-1s-1
pHTemp
°C
Beta-secretase 1
(Homo sapiens (Human))
BDBM50386512
(CHEMBL2048050)
Show SMILES C[C@@H](Oc1cc(C[C@@H]2CS(=O)(=O)C[C@H](NCc3cccc(c3)C(C)(C)C)[C@H]2O)cc(F)c1N)C(F)(F)F |r|
Show InChI InChI=1S/C26H34F4N2O4S/c1-15(26(28,29)30)36-22-11-17(10-20(27)23(22)31)8-18-13-37(34,35)14-21(24(18)33)32-12-16-6-5-7-19(9-16)25(2,3)4/h5-7,9-11,15,18,21,24,32-33H,8,12-14,31H2,1-4H3/t15-,18-,21+,24+/m1/s1
n/an/a 3n/an/an/an/an/an/a
Novartis Pharma AG
Curated by ChEMBL
Assay Description
Inhibition of human recombinant BACE1 ectodomain after 1 hr by fluorescence analysis
J Med Chem 55: 3364-86 (2012)
Article DOI: 10.1021/jm300069y
BindingDB Entry DOI: 10.7270/Q2P55PJW
Cathepsin D
(Homo sapiens (Human))
BDBM50386512
(CHEMBL2048050)
Show SMILES C[C@@H](Oc1cc(C[C@@H]2CS(=O)(=O)C[C@H](NCc3cccc(c3)C(C)(C)C)[C@H]2O)cc(F)c1N)C(F)(F)F |r|
Show InChI InChI=1S/C26H34F4N2O4S/c1-15(26(28,29)30)36-22-11-17(10-20(27)23(22)31)8-18-13-37(34,35)14-21(24(18)33)32-12-16-6-5-7-19(9-16)25(2,3)4/h5-7,9-11,15,18,21,24,32-33H,8,12-14,31H2,1-4H3/t15-,18-,21+,24+/m1/s1
NCI pathway
Reactome pathway
n/an/a 480n/an/an/an/an/an/a
Novartis Pharma AG
Curated by ChEMBL
Assay Description
Inhibition of human recombinant CatD using Mca-GKPILFFRLK(DNP)-dR-NH2 as substrate after 1 hr by fluorescence analysis
J Med Chem 55: 3364-86 (2012)
Article DOI: 10.1021/jm300069y
BindingDB Entry DOI: 10.7270/Q2P55PJW
Beta-secretase 1
(Homo sapiens (Human))
BDBM50386512
(CHEMBL2048050)
Show SMILES C[C@@H](Oc1cc(C[C@@H]2CS(=O)(=O)C[C@H](NCc3cccc(c3)C(C)(C)C)[C@H]2O)cc(F)c1N)C(F)(F)F |r|
Show InChI InChI=1S/C26H34F4N2O4S/c1-15(26(28,29)30)36-22-11-17(10-20(27)23(22)31)8-18-13-37(34,35)14-21(24(18)33)32-12-16-6-5-7-19(9-16)25(2,3)4/h5-7,9-11,15,18,21,24,32-33H,8,12-14,31H2,1-4H3/t15-,18-,21+,24+/m1/s1
n/an/a 105n/an/an/an/an/an/a
Novartis Pharma AG
Curated by ChEMBL
Assay Description
Inhibition of BACE-1 mediated amyloid beta 40 release in human wild type APP-transfected CHO cells by HTRF immunoassay
J Med Chem 55: 3364-86 (2012)
Article DOI: 10.1021/jm300069y
BindingDB Entry DOI: 10.7270/Q2P55PJW