null
SMILES: COC[C@@H](Oc1cc(C[C@@H]2CS(=O)(=O)C[C@H](NCc3cccc(c3)C(C)(C)C)[C@H]2O)cc(F)c1N)C(F)(F)F
InChI Key: InChIKey=OJCPUZZPOIXSSB-YIOTYYGMSA-N
Activity Spreadsheet -- Enzyme Inhibition Constant Data from BindingDB
Found 3 hits for monomerid = 50386515
Trg + Lig
Ki
nM
ΔG°
kcal/mole
IC50
nM
Kd
nM
EC50/IC50
nM
koff
s-1
kon
M-1s-1
pHTemp
°C
Beta-secretase 1
(Homo sapiens (Human))
BDBM50386515
(CHEMBL2048053)
Show SMILES COC[C@@H](Oc1cc(C[C@@H]2CS(=O)(=O)C[C@H](NCc3cccc(c3)C(C)(C)C)[C@H]2O)cc(F)c1N)C(F)(F)F |r|
Show InChI InChI=1S/C27H36F4N2O5S/c1-26(2,3)19-7-5-6-16(9-19)12-33-21-15-39(35,36)14-18(25(21)34)8-17-10-20(28)24(32)22(11-17)38-23(13-37-4)27(29,30)31/h5-7,9-11,18,21,23,25,33-34H,8,12-15,32H2,1-4H3/t18-,21+,23-,25+/m1/s1
n/an/a 2n/an/an/an/an/an/a
Novartis Pharma AG
Curated by ChEMBL
Assay Description
Inhibition of human recombinant BACE1 ectodomain after 1 hr by fluorescence analysis
J Med Chem 55: 3364-86 (2012)
Article DOI: 10.1021/jm300069y
BindingDB Entry DOI: 10.7270/Q2P55PJW
Cathepsin D
(Homo sapiens (Human))
BDBM50386515
(CHEMBL2048053)
Show SMILES COC[C@@H](Oc1cc(C[C@@H]2CS(=O)(=O)C[C@H](NCc3cccc(c3)C(C)(C)C)[C@H]2O)cc(F)c1N)C(F)(F)F |r|
Show InChI InChI=1S/C27H36F4N2O5S/c1-26(2,3)19-7-5-6-16(9-19)12-33-21-15-39(35,36)14-18(25(21)34)8-17-10-20(28)24(32)22(11-17)38-23(13-37-4)27(29,30)31/h5-7,9-11,18,21,23,25,33-34H,8,12-15,32H2,1-4H3/t18-,21+,23-,25+/m1/s1
NCI pathway
Reactome pathway
n/an/a 250n/an/an/an/an/an/a
Novartis Pharma AG
Curated by ChEMBL
Assay Description
Inhibition of human recombinant CatD using Mca-GKPILFFRLK(DNP)-dR-NH2 as substrate after 1 hr by fluorescence analysis
J Med Chem 55: 3364-86 (2012)
Article DOI: 10.1021/jm300069y
BindingDB Entry DOI: 10.7270/Q2P55PJW
Beta-secretase 1
(Homo sapiens (Human))
BDBM50386515
(CHEMBL2048053)
Show SMILES COC[C@@H](Oc1cc(C[C@@H]2CS(=O)(=O)C[C@H](NCc3cccc(c3)C(C)(C)C)[C@H]2O)cc(F)c1N)C(F)(F)F |r|
Show InChI InChI=1S/C27H36F4N2O5S/c1-26(2,3)19-7-5-6-16(9-19)12-33-21-15-39(35,36)14-18(25(21)34)8-17-10-20(28)24(32)22(11-17)38-23(13-37-4)27(29,30)31/h5-7,9-11,18,21,23,25,33-34H,8,12-15,32H2,1-4H3/t18-,21+,23-,25+/m1/s1
n/an/a 50n/an/an/an/an/an/a
Novartis Pharma AG
Curated by ChEMBL
Assay Description
Inhibition of BACE-1 mediated amyloid beta 40 release in human wild type APP-transfected CHO cells by HTRF immunoassay
J Med Chem 55: 3364-86 (2012)
Article DOI: 10.1021/jm300069y
BindingDB Entry DOI: 10.7270/Q2P55PJW