BDBM50386553 CHEMBL2048239
SMILES: OP(O)(=O)C(Nc1cc(ccn1)-c1ccccc1)P(O)(O)=O
InChI Key: InChIKey=ILDQYPKLOXAUMC-UHFFFAOYSA-N
Data: 2 IC50
Activity Spreadsheet -- Enzyme Inhibition Constant Data from BindingDB
Found 2 hits for monomerid = 50386553
Trg + Lig
Ki
nM
ΔG°
kcal/mole
IC50
nM
Kd
nM
EC50/IC50
nM
koff
s-1
kon
M-1s-1
pHTemp
°C
Farnesyl diphosphate synthase
(Homo sapiens (Human))
BDBM50386553
(CHEMBL2048239)
Show SMILES OP(O)(=O)C(Nc1cc(ccn1)-c1ccccc1)P(O)(O)=O
Show InChI InChI=1S/C12H14N2O6P2/c15-21(16,17)12(22(18,19)20)14-11-8-10(6-7-13-11)9-4-2-1-3-5-9/h1-8,12H,(H,13,14)(H2,15,16,17)(H2,18,19,20)
Reactome pathway
n/an/a 150n/an/an/an/an/an/a
McGill University
Curated by ChEMBL
Assay Description
Inhibition of human recombinant N-terminal-His6 tagged FPPS expressed in Escherichia coli BL21 using [14C]IPP and GPP as substrate incubated for 10 m...
J Med Chem 55: 3201-15 (2012)
Article DOI: 10.1021/jm201657x
BindingDB Entry DOI: 10.7270/Q29024V1
Farnesyl diphosphate synthase
(Homo sapiens (Human))
BDBM50386553
(CHEMBL2048239)
Show SMILES OP(O)(=O)C(Nc1cc(ccn1)-c1ccccc1)P(O)(O)=O
Show InChI InChI=1S/C12H14N2O6P2/c15-21(16,17)12(22(18,19)20)14-11-8-10(6-7-13-11)9-4-2-1-3-5-9/h1-8,12H,(H,13,14)(H2,15,16,17)(H2,18,19,20)
Reactome pathway
n/an/a 150n/an/an/an/an/an/a
McGill University
Curated by ChEMBL
Assay Description
Inhibition of human His6-tagged recombinant FPPS expressed in Escherichia coli BL21(DE3) using GPP and [3H]IPP as substrate incubated for 5 mins prio...
Bioorg Med Chem 20: 5583-91 (2012)
Article DOI: 10.1016/j.bmc.2012.07.019
BindingDB Entry DOI: 10.7270/Q2J67J6M