BDBM50386703 CHEMBL2048904
SMILES: Cn1ncc2c(Oc3ccc(Nc4ncnc5ccn(CCO)c45)cc3Cl)cccc12
InChI Key: InChIKey=NXBDRZNDPDCAAE-UHFFFAOYSA-N
Data: 2 IC50
Activity Spreadsheet -- Enzyme Inhibition Constant Data from BindingDB
Found 2 hits for monomerid = 50386703
Trg + Lig
Ki
nM
ΔG°
kcal/mole
IC50
nM
Kd
nM
EC50/IC50
nM
koff
s-1
kon
M-1s-1
pHTemp
°C
Receptor tyrosine-protein kinase erbB-2
(Homo sapiens (Human))
BDBM50386703
(CHEMBL2048904)
Show SMILES Cn1ncc2c(Oc3ccc(Nc4ncnc5ccn(CCO)c45)cc3Cl)cccc12
Show InChI InChI=1S/C22H19ClN6O2/c1-28-18-3-2-4-19(15(18)12-26-28)31-20-6-5-14(11-16(20)23)27-22-21-17(24-13-25-22)7-8-29(21)9-10-30/h2-8,11-13,30H,9-10H2,1H3,(H,24,25,27)
n/an/a 2.10n/an/an/an/an/an/a
Takeda Pharmaceutical Company Limited
Curated by ChEMBL
Assay Description
Inhibition of N-terminus peptide-tagged human recombinant HER2 expressed using baculovirus infection system using [gamma-33P]-ATP preincubated with c...
J Med Chem 55: 3975-91 (2012)
Article DOI: 10.1021/jm300185p
BindingDB Entry DOI: 10.7270/Q2474BX1
Epidermal growth factor receptor
(Homo sapiens (Human))
BDBM50386703
(CHEMBL2048904)
Show SMILES Cn1ncc2c(Oc3ccc(Nc4ncnc5ccn(CCO)c45)cc3Cl)cccc12
Show InChI InChI=1S/C22H19ClN6O2/c1-28-18-3-2-4-19(15(18)12-26-28)31-20-6-5-14(11-16(20)23)27-22-21-17(24-13-25-22)7-8-29(21)9-10-30/h2-8,11-13,30H,9-10H2,1H3,(H,24,25,27)
n/an/a 36n/an/an/an/an/an/a
Takeda Pharmaceutical Company Limited
Curated by ChEMBL
Assay Description
Inhibition of N-terminus peptide-tagged human recombinant EGFR expressed using baculovirus infection system using [gamma-33P]-ATP preincubated with c...
J Med Chem 55: 3975-91 (2012)
Article DOI: 10.1021/jm300185p
BindingDB Entry DOI: 10.7270/Q2474BX1