BDBM50386743 CHEMBL2046483
SMILES: CCCc1nc2ccc(NC(=O)c3ccccc3Cl)cc2c(=O)n1Cc1ccccc1Cl
InChI Key: InChIKey=CUSWBXVOIDRDJK-UHFFFAOYSA-N
Data: 2 IC50
Activity Spreadsheet -- Enzyme Inhibition Constant Data from BindingDB
Found 2 hits for monomerid = 50386743
Trg + Lig
Ki
nM
ΔG°
kcal/mole
IC50
nM
Kd
nM
EC50/IC50
nM
koff
s-1
kon
M-1s-1
pHTemp
°C
Prostaglandin E synthase
(Homo sapiens (Human))
BDBM50386743
(CHEMBL2046483)
Show SMILES CCCc1nc2ccc(NC(=O)c3ccccc3Cl)cc2c(=O)n1Cc1ccccc1Cl
Show InChI InChI=1S/C25H21Cl2N3O2/c1-2-7-23-29-22-13-12-17(28-24(31)18-9-4-6-11-21(18)27)14-19(22)25(32)30(23)15-16-8-3-5-10-20(16)26/h3-6,8-14H,2,7,15H2,1H3,(H,28,31)
Reactome pathway
n/an/a 180n/an/an/an/an/an/a
Johann Wolfgang Goethe-University
Curated by ChEMBL
Assay Description
Inhibition of mPGES-1 derived from IL1beta and TNFalpha stimulated human HeLa cells microsomal fraction using PGH2 as substrate preincubated for 30 m...
J Med Chem 55: 3792-803 (2012)
Article DOI: 10.1021/jm201687d
BindingDB Entry DOI: 10.7270/Q2QZ2C03
Prostaglandin E synthase
(Homo sapiens (Human))
BDBM50386743
(CHEMBL2046483)
Show SMILES CCCc1nc2ccc(NC(=O)c3ccccc3Cl)cc2c(=O)n1Cc1ccccc1Cl
Show InChI InChI=1S/C25H21Cl2N3O2/c1-2-7-23-29-22-13-12-17(28-24(31)18-9-4-6-11-21(18)27)14-19(22)25(32)30(23)15-16-8-3-5-10-20(16)26/h3-6,8-14H,2,7,15H2,1H3,(H,28,31)
Reactome pathway
n/an/a 180n/an/an/an/an/an/a
University of Innsbruck
Curated by ChEMBL
Assay Description
Inhibition of mPGES-1 in IL-1beta-stimulated human A549 cell microsomal membranes assessed as reduction in PGE2 formation incubated for 15 mins using...
Bioorg Med Chem 23: 4839-45 (2015)
BindingDB Entry DOI: 10.7270/Q2M90BF8