BDBM50386828 CHEMBL2047955
SMILES: COc1cc(ccc1Nc1nc(NC2CCCCC2)c2[nH]cnc2n1)N1CCOCC1
InChI Key: InChIKey=PSRBWLWUPONHPY-UHFFFAOYSA-N
Data: 1 IC50
Activity Spreadsheet -- Enzyme Inhibition Constant Data from BindingDB
Found 1 hit for monomerid = 50386828
Trg + Lig
Ki
nM
ΔG°
kcal/mole
IC50
nM
Kd
nM
EC50/IC50
nM
koff
s-1
kon
M-1s-1
pHTemp
°C
Dual specificity protein kinase TTK
(Homo sapiens (Human))
BDBM50386828
(CHEMBL2047955)
Show SMILES COc1cc(ccc1Nc1nc(NC2CCCCC2)c2[nH]cnc2n1)N1CCOCC1
Show InChI InChI=1S/C22H29N7O2/c1-30-18-13-16(29-9-11-31-12-10-29)7-8-17(18)26-22-27-20-19(23-14-24-20)21(28-22)25-15-5-3-2-4-6-15/h7-8,13-15H,2-6,9-12H2,1H3,(H3,23,24,25,26,27,28)
n/an/a 4n/an/an/an/an/an/a
Myrexis Inc.
Curated by ChEMBL
Assay Description
Inhibition of Mps1
Bioorg Med Chem Lett 22: 4377-85 (2012)
Article DOI: 10.1016/j.bmcl.2012.04.131
BindingDB Entry DOI: 10.7270/Q2PZ59V9