BDBM50386829 CHEMBL2047956
SMILES: CCOc1cc(ccc1Nc1nc(NC2CCCCC2)c2[nH]cnc2n1)N1CCOCC1
InChI Key: InChIKey=IEUKPPPUAZXHHY-UHFFFAOYSA-N
Data: 1 IC50
Activity Spreadsheet -- Enzyme Inhibition Constant Data from BindingDB
Found 1 hit for monomerid = 50386829
Trg + Lig
Ki
nM
ΔG°
kcal/mole
IC50
nM
Kd
nM
EC50/IC50
nM
koff
s-1
kon
M-1s-1
pHTemp
°C
Dual specificity protein kinase TTK
(Homo sapiens (Human))
BDBM50386829
(CHEMBL2047956)
Show SMILES CCOc1cc(ccc1Nc1nc(NC2CCCCC2)c2[nH]cnc2n1)N1CCOCC1
Show InChI InChI=1S/C23H31N7O2/c1-2-32-19-14-17(30-10-12-31-13-11-30)8-9-18(19)27-23-28-21-20(24-15-25-21)22(29-23)26-16-6-4-3-5-7-16/h8-9,14-16H,2-7,10-13H2,1H3,(H3,24,25,26,27,28,29)
n/an/a 1n/an/an/an/an/an/a
Myrexis Inc.
Curated by ChEMBL
Assay Description
Inhibition of Mps1
Bioorg Med Chem Lett 22: 4377-85 (2012)
Article DOI: 10.1016/j.bmcl.2012.04.131
BindingDB Entry DOI: 10.7270/Q2PZ59V9