BDBM50386847 CHEMBL2048080
SMILES: COc1cc(ccc1Nc1nc(NC2CCCCC2)c2[nH]cnc2n1)N1CCC(CC(=O)N2CCC(C2)N(C)C)CC1
InChI Key: InChIKey=GLEMLZUFCSHGAE-UHFFFAOYSA-N
Data: 1 IC50
Activity Spreadsheet -- Enzyme Inhibition Constant Data from BindingDB
Found 1 hit for monomerid = 50386847
Trg + Lig
Ki
nM
ΔG°
kcal/mole
IC50
nM
Kd
nM
EC50/IC50
nM
koff
s-1
kon
M-1s-1
pHTemp
°C
Dual specificity protein kinase TTK
(Homo sapiens (Human))
BDBM50386847
(CHEMBL2048080)
Show SMILES COc1cc(ccc1Nc1nc(NC2CCCCC2)c2[nH]cnc2n1)N1CCC(CC(=O)N2CCC(C2)N(C)C)CC1
Show InChI InChI=1S/C31H45N9O2/c1-38(2)24-13-16-40(19-24)27(41)17-21-11-14-39(15-12-21)23-9-10-25(26(18-23)42-3)35-31-36-29-28(32-20-33-29)30(37-31)34-22-7-5-4-6-8-22/h9-10,18,20-22,24H,4-8,11-17,19H2,1-3H3,(H3,32,33,34,35,36,37)
n/an/a 7n/an/an/an/an/an/a
Myrexis Inc.
Curated by ChEMBL
Assay Description
Inhibition of Mps1
Bioorg Med Chem Lett 22: 4377-85 (2012)
Article DOI: 10.1016/j.bmcl.2012.04.131
BindingDB Entry DOI: 10.7270/Q2PZ59V9