BDBM50386960 CHEMBL2048826
SMILES: C[C@H](N)C(=O)N(C)[C@@H](C)[C@H](NC(=O)[C@H](C)NC(=O)N[C@@H](Cc1c[nH]c2ccccc12)C(O)=O)C(=O)N\C=C1/O[C@H]([C@H](O)[C@@H]1O)n1ccc(=O)[nH]c1=O
InChI Key: InChIKey=OOMGUJKOXVKRQJ-MNRPCKSNSA-N
Data: 1 IC50
Activity Spreadsheet -- Enzyme Inhibition Constant Data from BindingDB
Found 1 hit for monomerid = 50386960
Trg + Lig
Ki
nM
ΔG°
kcal/mole
IC50
nM
Kd
nM
EC50/IC50
nM
koff
s-1
kon
M-1s-1
pHTemp
°C
Phospho-N-acetylmuramoyl-pentapeptide-transferase
(Staphylococcus aureus (strain MRSA252))
BDBM50386960
(CHEMBL2048826)
Show SMILES C[C@H](N)C(=O)N(C)[C@@H](C)[C@H](NC(=O)[C@H](C)NC(=O)N[C@@H](Cc1c[nH]c2ccccc12)C(O)=O)C(=O)N\C=C1/O[C@H]([C@H](O)[C@@H]1O)n1ccc(=O)[nH]c1=O |r|
Show InChI InChI=1S/C32H41N9O11/c1-14(33)28(47)40(4)16(3)23(27(46)35-13-21-24(43)25(44)29(52-21)41-10-9-22(42)38-32(41)51)39-26(45)15(2)36-31(50)37-20(30(48)49)11-17-12-34-19-8-6-5-7-18(17)19/h5-10,12-16,20,23-25,29,34,43-44H,11,33H2,1-4H3,(H,35,46)(H,39,45)(H,48,49)(H2,36,37,50)(H,38,42,51)/b21-13-/t14-,15-,16-,20-,23-,24+,25+,29+/m0/s1
n/an/a 42n/an/an/an/an/an/a
Shionogi& Co., Ltd
Curated by ChEMBL
Assay Description
Inhibition of Staphylococcus aureus MraY using UDP-MurNAc-dansylpentapeptide substrate assessed as formation of dansylated lipid I incubated for 3 to...
Bioorg Med Chem Lett 22: 4810-5 (2012)
Article DOI: 10.1016/j.bmcl.2012.05.050
BindingDB Entry DOI: 10.7270/Q2J967FP