BDBM50387508 CHEMBL2059853
SMILES: O=C(N[C@H](Cc1ccc2[nH]c(=O)oc2c1)C(=O)N1CCC(CC1)N1CCCCC1)N1CCC(CC1)N1Cc2ccccc2NC1=O
InChI Key: InChIKey=HBRMZOPADQKLOP-GDLZYMKVSA-N
Data: 1 KI  1 IC50
Activity Spreadsheet -- Enzyme Inhibition Constant Data from BindingDB
Found 2 hits for monomerid = 50387508
Trg + Lig
Ki
nM
ΔG°
kcal/mole
IC50
nM
Kd
nM
EC50/IC50
nM
koff
s-1
kon
M-1s-1
pHTemp
°C
Calcitonin gene-related peptide type 1 receptor
(Homo sapiens (Human))
BDBM50387508
(CHEMBL2059853)
Show SMILES O=C(N[C@H](Cc1ccc2[nH]c(=O)oc2c1)C(=O)N1CCC(CC1)N1CCCCC1)N1CCC(CC1)N1Cc2ccccc2NC1=O |r|
Show InChI InChI=1S/C34H43N7O5/c42-31(39-16-10-25(11-17-39)38-14-4-1-5-15-38)29(20-23-8-9-28-30(21-23)46-34(45)37-28)36-32(43)40-18-12-26(13-19-40)41-22-24-6-2-3-7-27(24)35-33(41)44/h2-3,6-9,21,25-26,29H,1,4-5,10-20,22H2,(H,35,44)(H,36,43)(H,37,45)/t29-/m1/s1
Reactome pathway
0.270n/an/an/an/an/an/an/an/a
Bristol-Myers Squibb Research& Development
Curated by ChEMBL
Assay Description
Displacement of [125I]CGRP from CGRP receptor in human SK-N-MC cell membrane after 2 hrs
Bioorg Med Chem Lett 22: 4723-7 (2012)
Article DOI: 10.1016/j.bmcl.2012.05.074
BindingDB Entry DOI: 10.7270/Q2SN0B1W
Cytochrome P450 3A4
(Homo sapiens (Human))
BDBM50387508
(CHEMBL2059853)
Show SMILES O=C(N[C@H](Cc1ccc2[nH]c(=O)oc2c1)C(=O)N1CCC(CC1)N1CCCCC1)N1CCC(CC1)N1Cc2ccccc2NC1=O |r|
Show InChI InChI=1S/C34H43N7O5/c42-31(39-16-10-25(11-17-39)38-14-4-1-5-15-38)29(20-23-8-9-28-30(21-23)46-34(45)37-28)36-32(43)40-18-12-26(13-19-40)41-22-24-6-2-3-7-27(24)35-33(41)44/h2-3,6-9,21,25-26,29H,1,4-5,10-20,22H2,(H,35,44)(H,36,43)(H,37,45)/t29-/m1/s1
Reactome pathway
n/an/a 3.00E+4n/an/an/an/an/an/a
Bristol-Myers Squibb Research& Development
Curated by ChEMBL
Assay Description
Inhibition of human recombinant CYP3A4 expressed in baculo-virus infected insect microsomes using benzyloxyresorufin as substrate after 45 mins by fl...
Bioorg Med Chem Lett 22: 4723-7 (2012)
Article DOI: 10.1016/j.bmcl.2012.05.074
BindingDB Entry DOI: 10.7270/Q2SN0B1W