BDBM50387513 CHEMBL2059880
SMILES: O=C(N[C@H](Cc1csc2ccccc12)C(=O)N1CCC(CC1)N1CCCCC1)N1CCC(CC1)n1c2ccccc2[nH]c1=O
InChI Key: InChIKey=CCCSWRIKNOQGJG-GDLZYMKVSA-N
Data: 1 KI  3 IC50
Activity Spreadsheet -- Enzyme Inhibition Constant Data from BindingDB
Found 4 hits for monomerid = 50387513
Trg + Lig
Ki
nM
ΔG°
kcal/mole
IC50
nM
Kd
nM
EC50/IC50
nM
koff
s-1
kon
M-1s-1
pHTemp
°C
Calcitonin gene-related peptide type 1 receptor
(Homo sapiens (Human))
BDBM50387513
(CHEMBL2059880)
Show SMILES O=C(N[C@H](Cc1csc2ccccc12)C(=O)N1CCC(CC1)N1CCCCC1)N1CCC(CC1)n1c2ccccc2[nH]c1=O |r|
Show InChI InChI=1S/C34H42N6O3S/c41-32(38-18-12-25(13-19-38)37-16-6-1-7-17-37)29(22-24-23-44-31-11-5-2-8-27(24)31)36-33(42)39-20-14-26(15-21-39)40-30-10-4-3-9-28(30)35-34(40)43/h2-5,8-11,23,25-26,29H,1,6-7,12-22H2,(H,35,43)(H,36,42)/t29-/m1/s1
Reactome pathway
0.550n/an/an/an/an/an/an/an/a
Bristol-Myers Squibb Research& Development
Curated by ChEMBL
Assay Description
Displacement of [125I]CGRP from CGRP receptor in human SK-N-MC cell membrane after 2 hrs
Bioorg Med Chem Lett 22: 4723-7 (2012)
Article DOI: 10.1016/j.bmcl.2012.05.074
BindingDB Entry DOI: 10.7270/Q2SN0B1W
Calcitonin gene-related peptide type 1 receptor
(Homo sapiens (Human))
BDBM50387513
(CHEMBL2059880)
Show SMILES O=C(N[C@H](Cc1csc2ccccc12)C(=O)N1CCC(CC1)N1CCCCC1)N1CCC(CC1)n1c2ccccc2[nH]c1=O |r|
Show InChI InChI=1S/C34H42N6O3S/c41-32(38-18-12-25(13-19-38)37-16-6-1-7-17-37)29(22-24-23-44-31-11-5-2-8-27(24)31)36-33(42)39-20-14-26(15-21-39)40-30-10-4-3-9-28(30)35-34(40)43/h2-5,8-11,23,25-26,29H,1,6-7,12-22H2,(H,35,43)(H,36,42)/t29-/m1/s1
Reactome pathway
n/an/a 9n/an/an/an/an/an/a
Bristol-Myers Squibb R&D
Curated by ChEMBL
Assay Description
Displacement of [125I]CGRP from CGRP receptor in human SK-N-MC cells
Bioorg Med Chem Lett 22: 4719-22 (2012)
Article DOI: 10.1016/j.bmcl.2012.05.118
BindingDB Entry DOI: 10.7270/Q2NV9K9M
Cytochrome P450 3A4
(Homo sapiens (Human))
BDBM50387513
(CHEMBL2059880)
Show SMILES O=C(N[C@H](Cc1csc2ccccc12)C(=O)N1CCC(CC1)N1CCCCC1)N1CCC(CC1)n1c2ccccc2[nH]c1=O |r|
Show InChI InChI=1S/C34H42N6O3S/c41-32(38-18-12-25(13-19-38)37-16-6-1-7-17-37)29(22-24-23-44-31-11-5-2-8-27(24)31)36-33(42)39-20-14-26(15-21-39)40-30-10-4-3-9-28(30)35-34(40)43/h2-5,8-11,23,25-26,29H,1,6-7,12-22H2,(H,35,43)(H,36,42)/t29-/m1/s1
Reactome pathway
n/an/a 84n/an/an/an/an/an/a
Bristol-Myers Squibb Research& Development
Curated by ChEMBL
Assay Description
Inhibition of human recombinant CYP3A4 expressed in baculo-virus infected insect microsomes using benzyloxyresorufin as substrate after 45 mins by fl...
Bioorg Med Chem Lett 22: 4723-7 (2012)
Article DOI: 10.1016/j.bmcl.2012.05.074
BindingDB Entry DOI: 10.7270/Q2SN0B1W
Cytochrome P450 3A4
(Homo sapiens (Human))
BDBM50387513
(CHEMBL2059880)
Show SMILES O=C(N[C@H](Cc1csc2ccccc12)C(=O)N1CCC(CC1)N1CCCCC1)N1CCC(CC1)n1c2ccccc2[nH]c1=O |r|
Show InChI InChI=1S/C34H42N6O3S/c41-32(38-18-12-25(13-19-38)37-16-6-1-7-17-37)29(22-24-23-44-31-11-5-2-8-27(24)31)36-33(42)39-20-14-26(15-21-39)40-30-10-4-3-9-28(30)35-34(40)43/h2-5,8-11,23,25-26,29H,1,6-7,12-22H2,(H,35,43)(H,36,42)/t29-/m1/s1
Reactome pathway
n/an/a 870n/an/an/an/an/an/a
Bristol-Myers Squibb Research& Development
Curated by ChEMBL
Assay Description
Inhibition of human recombinant CYP3A4 expressed in baculo-virus infected insect microsomes using 7-benzyloxy-4-trifluoromethylcoumarin as substrate ...
Bioorg Med Chem Lett 22: 4723-7 (2012)
Article DOI: 10.1016/j.bmcl.2012.05.074
BindingDB Entry DOI: 10.7270/Q2SN0B1W