BDBM50387568 CHEMBL2057713
SMILES: C1CC2(CN1c1cccnc1)CC1CCN2CC1
InChI Key: InChIKey=RHQJWLPJMQCJOF-UHFFFAOYSA-N
Data: 3 KI  1 EC50
Activity Spreadsheet -- Enzyme Inhibition Constant Data from BindingDB
Found 4 hits for monomerid = 50387568
Trg + Lig
Ki
nM
ΔG°
kcal/mole
IC50
nM
Kd
nM
EC50/IC50
nM
koff
s-1
kon
M-1s-1
pHTemp
°C
Neuronal acetylcholine receptor Alpha-4/Beta-2
(Homo sapiens (Human))
BDBM50387568
(CHEMBL2057713)
Show SMILES C1CC2(CN1c1cccnc1)CC1CCN2CC1
Show InChI InChI=1S/C15H21N3/c1-2-14(11-16-6-1)17-9-5-15(12-17)10-13-3-7-18(15)8-4-13/h1-2,6,11,13H,3-5,7-10,12H2
NCI pathway
Reactome pathway
32n/an/an/an/an/an/an/an/a
Targacept, Inc.
Curated by ChEMBL
Assay Description
Displacement of [3H]-epibatidine from human nAChR alpha4beta2 expressed in human SH-EP1 cells
Bioorg Med Chem Lett 22: 5089-92 (2012)
Article DOI: 10.1016/j.bmcl.2012.05.108
BindingDB Entry DOI: 10.7270/Q24X58W1
Neuronal acetylcholine receptor; alpha3/beta4
(Homo sapiens (Human))
BDBM50387568
(CHEMBL2057713)
Show SMILES C1CC2(CN1c1cccnc1)CC1CCN2CC1
Show InChI InChI=1S/C15H21N3/c1-2-14(11-16-6-1)17-9-5-15(12-17)10-13-3-7-18(15)8-4-13/h1-2,6,11,13H,3-5,7-10,12H2
1.10E+3n/an/an/an/an/an/an/an/a
Targacept, Inc.
Curated by ChEMBL
Assay Description
Binding affinity to human ganglionic nAChR alpha3beta4 expressed in human SHSY-5Y cells
Bioorg Med Chem Lett 22: 5089-92 (2012)
Article DOI: 10.1016/j.bmcl.2012.05.108
BindingDB Entry DOI: 10.7270/Q24X58W1
Neuronal acetylcholine receptor protein alpha-7 subunit
(Homo sapiens (Human))
BDBM50387568
(CHEMBL2057713)
Show SMILES C1CC2(CN1c1cccnc1)CC1CCN2CC1
Show InChI InChI=1S/C15H21N3/c1-2-14(11-16-6-1)17-9-5-15(12-17)10-13-3-7-18(15)8-4-13/h1-2,6,11,13H,3-5,7-10,12H2
8.00E+3n/an/an/an/an/an/an/an/a
Targacept, Inc.
Curated by ChEMBL
Assay Description
Binding affinity to human nAChR alpha7 expressed in HEK cells coexpressing RIC3
Bioorg Med Chem Lett 22: 5089-92 (2012)
Article DOI: 10.1016/j.bmcl.2012.05.108
BindingDB Entry DOI: 10.7270/Q24X58W1
Neuronal acetylcholine receptor; alpha3/beta4
(Homo sapiens (Human))
BDBM50387568
(CHEMBL2057713)
Show SMILES C1CC2(CN1c1cccnc1)CC1CCN2CC1
Show InChI InChI=1S/C15H21N3/c1-2-14(11-16-6-1)17-9-5-15(12-17)10-13-3-7-18(15)8-4-13/h1-2,6,11,13H,3-5,7-10,12H2
n/an/an/an/a 6.90E+3n/an/an/an/a
Targacept, Inc.
Curated by ChEMBL
Assay Description
Antagonist activity at human ganglionic nAChR alpha3beta4 expressed in human SHSY-5Y cells assessed as calcium flux by fluorescence analysis
Bioorg Med Chem Lett 22: 5089-92 (2012)
Article DOI: 10.1016/j.bmcl.2012.05.108
BindingDB Entry DOI: 10.7270/Q24X58W1