BDBM50387601 CHEMBL2058596
SMILES: CCC(C1CC1)n1c2nccc(-c3cc(F)c(cc3Cl)N(C)C)c2nc(C)c1=O
InChI Key: InChIKey=JKBSIXLJINISOR-UHFFFAOYSA-N
Data: 1 IC50
Activity Spreadsheet -- Enzyme Inhibition Constant Data from BindingDB
Found 1 hit for monomerid = 50387601
Trg + Lig
Ki
nM
ΔG°
kcal/mole
IC50
nM
Kd
nM
EC50/IC50
nM
koff
s-1
kon
M-1s-1
pHTemp
°C
Corticotropin releasing factor receptor
(Rattus norvegicus (rat))
BDBM50387601
(CHEMBL2058596)
Show SMILES CCC(C1CC1)n1c2nccc(-c3cc(F)c(cc3Cl)N(C)C)c2nc(C)c1=O
Show InChI InChI=1S/C22H24ClFN4O/c1-5-18(13-6-7-13)28-21-20(26-12(2)22(28)29)14(8-9-25-21)15-10-17(24)19(27(3)4)11-16(15)23/h8-11,13,18H,5-7H2,1-4H3
Reactome pathway
n/an/a 0.820n/an/an/an/an/an/a
Bristol-Myers Squibb Co
Curated by ChEMBL
Assay Description
Antagonist activity at rat CFR1R
Bioorg Med Chem Lett 22: 4986-9 (2012)
Article DOI: 10.1016/j.bmcl.2012.06.034
BindingDB Entry DOI: 10.7270/Q23X87Q6