BDBM50387943 CHEMBL2058924::US9283222, 510
SMILES: Fc1ccc(Cc2n[nH]c(=O)c3CCCNc23)cc1C(=O)N1CCN(CC1)c1ccncc1
InChI Key: InChIKey=BDPJKAORASQKHG-UHFFFAOYSA-N
Data: 2 KI  1 EC50
Activity Spreadsheet -- Enzyme Inhibition Constant Data from BindingDB
Found 3 hits for monomerid = 50387943
Trg + Lig
Ki
nM
ΔG°
kcal/mole
IC50
nM
Kd
nM
EC50/IC50
nM
koff
s-1
kon
M-1s-1
pHTemp
°C
Poly [ADP-ribose] polymerase 1
(Homo sapiens (Human))
BDBM50387943
(CHEMBL2058924 | US9283222, 510)
Show SMILES Fc1ccc(Cc2n[nH]c(=O)c3CCCNc23)cc1C(=O)N1CCN(CC1)c1ccncc1
Show InChI InChI=1S/C24H25FN6O2/c25-20-4-3-16(15-21-22-18(2-1-7-27-22)23(32)29-28-21)14-19(20)24(33)31-12-10-30(11-13-31)17-5-8-26-9-6-17/h3-6,8-9,14,27H,1-2,7,10-13,15H2,(H,29,32)
US Patent
1.20n/an/an/an/an/an/a8.0n/a
AbbVie Inc.
US Patent
Assay Description
PARP1 assay was conducted in PARP assay buffer containing 50 mM Tris pH 8.0, 1 mM DTT, 4 mM MgCl2. PARP reactions contained 1.5 uM [3H]-NAD+ (1.6 uCi...
US Patent US9283222 (2016)
BindingDB Entry DOI: 10.7270/Q2BZ64XD
Poly [ADP-ribose] polymerase 1
(Homo sapiens (Human))
BDBM50387943
(CHEMBL2058924 | US9283222, 510)
Show SMILES Fc1ccc(Cc2n[nH]c(=O)c3CCCNc23)cc1C(=O)N1CCN(CC1)c1ccncc1
Show InChI InChI=1S/C24H25FN6O2/c25-20-4-3-16(15-21-22-18(2-1-7-27-22)23(32)29-28-21)14-19(20)24(33)31-12-10-30(11-13-31)17-5-8-26-9-6-17/h3-6,8-9,14,27H,1-2,7,10-13,15H2,(H,29,32)
1.20n/an/an/an/an/an/an/an/a
Abbott Laboratories
Curated by ChEMBL
Assay Description
Inhibition of PARP1 using [3H]NAD+ after 1 hr by scintillation counting
Bioorg Med Chem 20: 4635-45 (2012)
Article DOI: 10.1016/j.bmc.2012.06.021
BindingDB Entry DOI: 10.7270/Q2PN96P7
Poly [ADP-ribose] polymerase 1
(Homo sapiens (Human))
BDBM50387943
(CHEMBL2058924 | US9283222, 510)
Show SMILES Fc1ccc(Cc2n[nH]c(=O)c3CCCNc23)cc1C(=O)N1CCN(CC1)c1ccncc1
Show InChI InChI=1S/C24H25FN6O2/c25-20-4-3-16(15-21-22-18(2-1-7-27-22)23(32)29-28-21)14-19(20)24(33)31-12-10-30(11-13-31)17-5-8-26-9-6-17/h3-6,8-9,14,27H,1-2,7,10-13,15H2,(H,29,32)
n/an/an/an/a 39n/an/an/an/a
Abbott Laboratories
Curated by ChEMBL
Assay Description
Inhibition of PARP1 in H202-stimulated human C41 cells incubated for 30 mins prior to H2O2-treatment measured after 10 mins by FITC-based immunostain...
Bioorg Med Chem 20: 4635-45 (2012)
Article DOI: 10.1016/j.bmc.2012.06.021
BindingDB Entry DOI: 10.7270/Q2PN96P7